{"text_format":"1","workbook":"xlsx","n_sheets":5,"sheets":["Adatlap","Kulcs-Soft","BANK","Munka1","FEOR"],"not_rendered":{"charts":0,"images":1,"macros":1,"external_links":0,"defined_names":2,"comments":0,"pivot_tables":0},"unopened":[],"bounds":{"document_bytes":16777216,"sheet_cells":100000,"rows_first":2000,"rows_last":500,"rows_between":2000,"halvings":0,"cell_chars":16384,"cell_head_chars":4096},"cells_cut":0,"cells_raw":0,"read":"whole","date_system":"1900"}

{"sheet":"Adatlap","index":0,"n_rows":3588,"n_cols":24,"rows_kept":3588,"cut":false,"hidden":false,"merged":[[2,0,2,13],[45,6,45,9],[3,0,3,13],[23,5,23,12],[30,6,30,8],[31,6,31,8],[32,6,32,8],[40,1,40,12],[41,1,41,12],[42,1,42,12],[30,2,30,4],[32,2,32,4],[31,2,31,4],[6,6,6,8],[31,9,31,11],[30,9,30,11],[50,1,50,12],[43,1,43,12]]}
[]
[]
["ADATLAP BÉRSZÁMFEJTÉSHEZ"]
[null,null,null,null,null,null,null,null,null,null,null,null,null,null,null,"Kérem válasszon!","Kérem válasszon!","Kérem válasszon!",null,"Kérem válasszon!","Postal Code\nIrányítószám","Place Name\nTelepülés","County\nMegye"]
[null,null,null,null,null,null,null,null,null,null,null,null,null,null,null,"IGEN","nő",1,null,20,8128,"Aba","Fejér"]
[null,null,"vezetéknév","keresztnév 1","keresztnév 2",null,"neme",null,null,null,null,null,null,null,null,"NEM","férfi",2,null,30,8127,"Aba","Fejér"]
[null,"Munkavállaló neve: ",null,null,null,null,"férfi",null,null,null,null,null,null,null,null,null,null,3,null,70,5241,"Abádszalók","Jász-Nagykun-Szolnok"]
[null,"Születési neve:",null,null,null,null,null,null,null,null,null,null,null,null,null,null,null,4,null,null,7678,"Abaliget","Baranya"]
[null,"Anyja neve:",null,null,null,null,null,null,null,null,null,null,null,null,null,null,null,5,null,null,3261,"Abasár","Heves"]
[null,"Állampolgálsága:",null,null,null,null,null,null,null,null,null,null,null,null,null,null,null,6,null,null,3882,"Abaújalpár","Borsod-Abaúj-Zemplén"]
[null,null,"ország","város",null,null,null,null,null,null,null,null,null,null,null,null,null,7,null,null,3882,"Abaújkér","Borsod-Abaúj-Zemplén"]
[null,"Szül. hely:","Magyarország",null,null,null,null,null,null,null,null,null,null,null,null,null,null,8,null,null,3815,"Abaújlak","Borsod-Abaúj-Zemplén"]
[null,null,"év","hónap","nap",null,null,null,null,null,null,null,null,null,null,null,null,9,null,null,3881,"Abaújszántó","Borsod-Abaúj-Zemplén"]
[null,"Szül. idő:",null,null,null,null,null,null,null,null,null,null,null,null,null,null,null,10,null,null,3809,"Abaújszolnok","Borsod-Abaúj-Zemplén"]
[null,null,null,null,null,null,null,null,null,null,null,null,null,null,null,null,null,11,null,null,3898,"Abaújvár","Borsod-Abaúj-Zemplén"]
[null,"Adóazonosító:",null,"TAJ sz.:",null,null,null,null,null,null,null,null,null,null,null,null,null,12,null,null,9151,"Abda","Győr-Moson-Sopron"]
[null,null,null,null,null,null,null,null,null,null,null,null,null,null,null,null,null,null,null,null,3753,"Abod","Borsod-Abaúj-Zemplén"]
[null,"Nyugdíjas: ","NEM","kezdő nap:",null,"Nyugdíj. tipusa "]
[null,null,null,null,null,null,null,null,null,null,null,null,null,null,null,null,null,null,null,null,null,2740,"Abony"]
[null,null,"ország","irányítószám","város","közterület","jellege","házszám","épület","lh.","emelet","ajtó","terület",null,null,null,null,null,null,null,null,8256,"Ábrahámhegy","Pest"]
[null,"Állandó lakcíme:",null,null,null,null,null,null,null,null,null,null,null,null,null,null,null,null,null,null,null,2941,"Ács","Veszprém"]
[null,"Levelezési címe:",null,null,null,null,null,null,null,null,null,null,null,null,null,null,null,null,null,null,null,null,null,"Komárom-Esztergom"]
[null,null,null,null,null,null,null,null,null,null,null,null,null,null,null,null,null,null,null,null,2683,"Acsa","Pest"]
[null,"Iskolai végzettsége:",null,null,"Intézmény megnevezése:",null,null,null,null,null,null,null,null,null,null,null,null,null,null,null,9746,"Acsád","Vas"]
[null,"Igazoló dokumentum száma:"]
[null,null,null,null,null,null,null,null,null,null,null,null,null,null,null,null,null,null,null,null,9168,"Acsalag","Győr-Moson-Sopron"]
[null,"Bankszámlaszáma:",null,null,null,null,null,null,null,null,null,null,null,null,null,null,null,null,null,null,2887,"Ácsteszér","Komárom-Esztergom"]
[null,"E-mail címe: ",null,null,null,null,null,null,null,null,null,null,null,null,null,null,null,null,null,null,3292,"Adács","Heves"]
[null,"Mobil telefonszám:","Kérem válasszon!"]
[null,null,null,null,null,null,null,null,null,null,null,null,null,null,null,null,null,null,null,null,8653,"Ádánd","Somogy"]
[null,"Munkahely neve:",null,null,null,"Belépés dátuma:",null,null,null,"Összeg:",null,null,null,null,null,null,null,null,null,null,8561,"Adásztevel","Veszprém"]
[null,"Munkakör:",null,null,null,"Munkabér:","Kérem válasszon!",null,null,null,null,null,null,null,null,null,null,null,null,null,2457,"Adony","Fejér"]
[null,"Munkarend:","Kérem válasszon!",null,null,"Munkaidő:"]
[null,null,null,null,null,null,null,null,null,null,null,null,null,null,null,null,null,null,null,null,8497,"Adorjánháza","Veszprém"]
[null,"Előző munkahelyről hozott igazolások",null,null,null,null,null,null,null,null,null,null,null,null,null,null,null,null,null,null,7841,"Adorjás","Baranya"]
[null,null,"Munkaviszony igazolás",null,"Adó adatlap",null,"TB kiskönyv"]
[null,null,null,null,null,null,null,null,null,null,null,null,null,null,null,null,null,null,null,null,7381,"Ág","Baranya"]
[null,"Egyéb igazolás:"]
[null,null,null,null,null,null,null,null,null,null,null,null,null,null,null,null,null,null,null,null,6076,"Ágasegyháza","Bács-Kiskun"]
[null,"Nyilatkozat",null,null,null,null,null,null,null,null,null,null,null,null,null,null,null,null,null,null,9423,"Ágfalva","Győr-Moson-Sopron"]
[null,{"$f":"CONCATENATE(\" Alulírott \",C7,\" \",D7,\" nyilatkozom,\",)","v":" Alulírott   nyilatkozom,"},null,null,null,null,null,null,null,null,null,null,null,null,null,null,null,null,null,null,3759,"Aggtelek","Borsod-Abaúj-Zemplén"]
[null," hogy az előző munkahelyemről igazolásokat nem kaptam, ",null,null,null,null,null,null,null,null,null,null,null,null,null,null,null,null,null,null,9441,"Agyagosszergény","Győr-Moson-Sopron"]
[null," illetve munkaviszonyba nem álltam.",null,null,null,null,null,null,null,null,null,null,null,null,null,null,null,null,null,null,4524,"Ajak","Szabolcs-Szatmár-Bereg"]
[null,"(Kérem jelölje a megfelelő mondat részt)",null,null,null,null,null,null,null,null,null,null,null,null,null,null,null,null,null,null,8447,"Ajka","Veszprém"]
[null,null,null,null,null,null,null,null,null,null,null,null,null,null,null,null,null,null,null,null,8448,"Ajka","Veszprém"]
[null,"Munkavállaló Egység kódja: ",null,null,null,"Költségvetési besorolása:",null,null,null,null,null,null,null,null,null,null,null,null,null,null,8451,"Ajka","Veszprém"]
[null,null,null,null,null,null,null,null,null,null,null,null,null,null,null,null,null,null,null,null,8400,"Ajka","Veszprém"]
[null,"Egyéb belső azonosító kód:",null,"(beléptető kártya, újlenyomat)",null,null,null,null,null,null,null,null,null,null,null,null,null,null,null,null,2862,"Aka","Komárom-Esztergom"]
[null,null,null,null,null,null,null,null,null,null,null,null,null,null,null,null,null,null,null,null,6221,"Akasztó","Bács-Kiskun"]
[null,"Adatkezelési nyilatkozat:",null,null,null,null,null,null,null,null,null,null,null,null,null,null,null,null,null,null,3779,"Alacska","Borsod-Abaúj-Zemplén"]
[null,"Fent nevezett munkavállaló beleegyezem, hogy munkáltatóm, \nilletve általa megbízott külső bérszámfejtő cég az adatlapon megadott személyes adataimat\n a hatályos adatkezelési előírásoknak megfelelően kezelje. ",null,null,null,null,null,null,null,null,null,null,null,null,null,null,null,null,null,null,7011,"Alap","Fejér"]
[null,null,null,null,null,null,null,null,null,null,null,null,null,null,null,null,null,null,null,null,5142,"Alattyán","Jász-Nagykun-Szolnok"]
[]
[]
[]
[null,"Dátum:",null,null,null,null,null,null,null,null,null,null,null,null,null,null,null,null,null,null,2730,"Albertirsa","Pest"]
[null,null,null,null,null,null,null,null,null,null,null,null,null,null,null,null,null,null,null,null,8087,"Alcsútdoboz","Fejér"]
[null,null,null,null,null,null,null,null,null,null,null,null,null,null,null,null,null,null,null,null,3353,"Aldebrő","Heves"]
[null,null,"Munkáltató aláírása",null,null,"Munkavállaló aláírása",null,null,null,null,null,null,null,null,null,null,null,null,null,null,6750,"Algyő","Csongrád"]
[null,null,null,null,null,null,null,null,null,null,null,null,null,null,null,null,null,null,null,null,8921,"Alibánfa","Zala"]
[null,null,null,null,null,null,null,null,null,null,null,null,null,null,null,null,null,null,null,null,7934,"Almamellék","Baranya"]
[null,null,null,null,null,null,null,null,null,null,null,null,null,null,null,null,null,null,null,null,2931,"Almásfüzitő","Komárom-Esztergom"]
[null,null,null,null,null,null,null,null,null,null,null,null,null,null,null,null,null,null,null,null,8935,"Almásháza","Zala"]
[null,null,null,null,null,null,null,null,null,null,null,null,null,null,null,null,null,null,null,null,5747,"Almáskamarás","Békés"]
[null,null,null,null,null,null,null,null,null,null,null,null,null,null,null,null,null,null,null,null,7932,"Almáskeresztúr","Baranya"]
[null,null,null,null,null,null,null,null,null,null,null,null,null,null,null,null,null,null,null,null,4285,"Álmosd","Hajdú-Bihar"]
[null,null,null,null,null,null,null,null,null,null,null,null,null,null,null,null,null,null,null,null,3985,"Alsóberecki","Borsod-Abaúj-Zemplén"]
[null,null,null,null,null,null,null,null,null,null,null,null,null,null,null,null,null,null,null,null,7443,"Alsóbogát","Somogy"]
[null,null,null,null,null,null,null,null,null,null,null,null,null,null,null,null,null,null,null,null,3717,"Alsódobsza","Borsod-Abaúj-Zemplén"]
[null,null,null,null,null,null,null,null,null,null,null,null,null,null,null,null,null,null,null,null,3837,"Alsógagy","Borsod-Abaúj-Zemplén"]
[null,null,null,null,null,null,null,null,null,null,null,null,null,null,null,null,null,null,null,null,7345,"Alsómocsolád","Baranya"]
[null,null,null,null,null,null,null,null,null,null,null,null,null,null,null,null,null,null,null,null,7147,"Alsónána","Tolna"]
[null,null,null,null,null,null,null,null,null,null,null,null,null,null,null,null,null,null,null,null,2351,"Alsónémedi","Pest"]
[null,null,null,null,null,null,null,null,null,null,null,null,null,null,null,null,null,null,null,null,8924,"Alsónemesapáti","Zala"]
[null,null,null,null,null,null,null,null,null,null,null,null,null,null,null,null,null,null,null,null,7148,"Alsónyék","Tolna"]
[null,null,null,null,null,null,null,null,null,null,null,null,null,null,null,null,null,null,null,null,8226,"Alsóörs","Veszprém"]
[null,null,null,null,null,null,null,null,null,null,null,null,null,null,null,null,null,null,null,null,8394,"Alsópáhok","Zala"]
[null,null,null,null,null,null,null,null,null,null,null,null,null,null,null,null,null,null,null,null,2617,"Alsópetény","Nógrád"]
[null,null,null,null,null,null,null,null,null,null,null,null,null,null,null,null,null,null,null,null,8767,"Alsórajk","Zala"]
[null,null,null,null,null,null,null,null,null,null,null,null,null,null,null,null,null,null,null,null,3989,"Alsóregmec","Borsod-Abaúj-Zemplén"]
[null,null,null,null,null,null,null,null,null,null,null,null,null,null,null,null,null,null,null,null,8973,"Alsószenterzsébet","Zala"]
[null,null,null,null,null,null,null,null,null,null,null,null,null,null,null,null,null,null,null,null,7012,"Alsószentiván","Fejér"]
[null,null,null,null,null,null,null,null,null,null,null,null,null,null,null,null,null,null,null,null,7826,"Alsószentmárton","Baranya"]
[null,null,null,null,null,null,null,null,null,null,null,null,null,null,null,null,null,null,null,null,9983,"Alsószölnök","Vas"]
[null,null,null,null,null,null,null,null,null,null,null,null,null,null,null,null,null,null,null,null,3726,"Alsószuha","Borsod-Abaúj-Zemplén"]
[null,null,null,null,null,null,null,null,null,null,null,null,null,null,null,null,null,null,null,null,3735,"Alsótelekes","Borsod-Abaúj-Zemplén"]
[null,null,null,null,null,null,null,null,null,null,null,null,null,null,null,null,null,null,null,null,3069,"Alsótold","Nógrád"]
[null,null,null,null,null,null,null,null,null,null,null,null,null,null,null,null,null,null,null,null,9842,"Alsóújlak","Vas"]
[null,null,null,null,null,null,null,null,null,null,null,null,null,null,null,null,null,null,null,null,3811,"Alsóvadász","Borsod-Abaúj-Zemplén"]
[null,null,null,null,null,null,null,null,null,null,null,null,null,null,null,null,null,null,null,null,3571,"Alsózsolca","Borsod-Abaúj-Zemplén"]
[null,null,null,null,null,null,null,null,null,null,null,null,null,null,null,null,null,null,null,null,6916,"Ambrózfalva","Csongrád"]
[null,null,null,null,null,null,null,null,null,null,null,null,null,null,null,null,null,null,null,null,4546,"Anarcs","Szabolcs-Szatmár-Bereg"]
[null,null,null,null,null,null,null,null,null,null,null,null,null,null,null,null,null,null,null,null,8675,"Andocs","Somogy"]
[null,null,null,null,null,null,null,null,null,null,null,null,null,null,null,null,null,null,null,null,3399,"Andornaktálya","Heves"]
[null,null,null,null,null,null,null,null,null,null,null,null,null,null,null,null,null,null,null,null,9811,"Andrásfa","Vas"]
[null,null,null,null,null,null,null,null,null,null,null,null,null,null,null,null,null,null,null,null,2529,"Annavölgy","Komárom-Esztergom"]
[null,null,null,null,null,null,null,null,null,null,null,null,null,null,null,null,null,null,null,null,8477,"Apácatorna","Veszprém"]
[null,null,null,null,null,null,null,null,null,null,null,null,null,null,null,null,null,null,null,null,4553,"Apagy","Szabolcs-Szatmár-Bereg"]
[null,null,null,null,null,null,null,null,null,null,null,null,null,null,null,null,null,null,null,null,2345,"Apaj","Pest"]
[null,null,null,null,null,null,null,null,null,null,null,null,null,null,null,null,null,null,null,null,7186,"Aparhant","Tolna"]
[null,null,null,null,null,null,null,null,null,null,null,null,null,null,null,null,null,null,null,null,6931,"Apátfalva","Csongrád"]
[null,null,null,null,null,null,null,null,null,null,null,null,null,null,null,null,null,null,null,null,9982,"Apátistvánfalva","Vas"]
[null,null,null,null,null,null,null,null,null,null,null,null,null,null,null,null,null,null,null,null,7720,"Apátvarasd","Baranya"]
[null,null,null,null,null,null,null,null,null,null,null,null,null,null,null,null,null,null,null,null,3032,"Apc","Heves"]
[null,null,null,null,null,null,null,null,null,null,null,null,null,null,null,null,null,null,null,null,2338,"Áporka","Pest"]
[null,null,null,null,null,null,null,null,null,null,null,null,null,null,null,null,null,null,null,null,6088,"Apostag","Bács-Kiskun"]
[null,null,null,null,null,null,null,null,null,null,null,null,null,null,null,null,null,null,null,null,4634,"Aranyosapáti","Szabolcs-Szatmár-Bereg"]
[null,null,null,null,null,null,null,null,null,null,null,null,null,null,null,null,null,null,null,null,7671,"Aranyosgadány","Baranya"]
[null,null,null,null,null,null,null,null,null,null,null,null,null,null,null,null,null,null,null,null,3885,"Arka","Borsod-Abaúj-Zemplén"]
[null,null,null,null,null,null,null,null,null,null,null,null,null,null,null,null,null,null,null,null,3663,"Arló","Borsod-Abaúj-Zemplén"]
[null,null,null,null,null,null,null,null,null,null,null,null,null,null,null,null,null,null,null,null,3713,"Arnót","Borsod-Abaúj-Zemplén"]
[null,null,null,null,null,null,null,null,null,null,null,null,null,null,null,null,null,null,null,null,3467,"Ároktő","Borsod-Abaúj-Zemplén"]
[null,null,null,null,null,null,null,null,null,null,null,null,null,null,null,null,null,null,null,null,6623,"Árpádhalom","Csongrád"]
[null,null,null,null,null,null,null,null,null,null,null,null,null,null,null,null,null,null,null,null,9132,"Árpás","Győr-Moson-Sopron"]
[null,null,null,null,null,null,null,null,null,null,null,null,null,null,null,null,null,null,null,null,4115,"Ártánd","Hajdú-Bihar"]
[null,null,null,null,null,null,null,null,null,null,null,null,null,null,null,null,null,null,null,null,6783,"Ásotthalom","Csongrád"]
[null,null,null,null,null,null,null,null,null,null,null,null,null,null,null,null,null,null,null,null,9177,"Ásványráró","Győr-Moson-Sopron"]
[null,null,null,null,null,null,null,null,null,null,null,null,null,null,null,null,null,null,null,null,3841,"Aszaló","Borsod-Abaúj-Zemplén"]
[null,null,null,null,null,null,null,null,null,null,null,null,null,null,null,null,null,null,null,null,2170,"Aszód","Pest"]
[null,null,null,null,null,null,null,null,null,null,null,null,null,null,null,null,null,null,null,null,8241,"Aszófő","Veszprém"]
[null,null,null,null,null,null,null,null,null,null,null,null,null,null,null,null,null,null,null,null,7763,"Áta","Baranya"]
[null,null,null,null,null,null,null,null,null,null,null,null,null,null,null,null,null,null,null,null,3371,"Átány","Heves"]
[null,null,null,null,null,null,null,null,null,null,null,null,null,null,null,null,null,null,null,null,3213,"Atkár","Heves"]
[null,null,null,null,null,null,null,null,null,null,null,null,null,null,null,null,null,null,null,null,7252,"Attala","Tolna"]
[null,null,null,null,null,null,null,null,null,null,null,null,null,null,null,null,null,null,null,null,7757,"Babarc","Baranya"]
[null,null,null,null,null,null,null,null,null,null,null,null,null,null,null,null,null,null,null,null,7814,"Babarcszőlős","Baranya"]
[null,null,null,null,null,null,null,null,null,null,null,null,null,null,null,null,null,null,null,null,7584,"Babócsa","Somogy"]
[null,null,null,null,null,null,null,null,null,null,null,null,null,null,null,null,null,null,null,null,2943,"Bábolna","Komárom-Esztergom"]
[null,null,null,null,null,null,null,null,null,null,null,null,null,null,null,null,null,null,null,null,8658,"Bábonymegyer","Somogy"]
[null,null,null,null,null,null,null,null,null,null,null,null,null,null,null,null,null,null,null,null,8983,"Babosdöbréte","Zala"]
[null,null,null,null,null,null,null,null,null,null,null,null,null,null,null,null,null,null,null,null,9351,"Babót","Győr-Moson-Sopron"]
[null,null,null,null,null,null,null,null,null,null,null,null,null,null,null,null,null,null,null,null,6430,"Bácsalmás","Bács-Kiskun"]
[null,null,null,null,null,null,null,null,null,null,null,null,null,null,null,null,null,null,null,null,6453,"Bácsbokod","Bács-Kiskun"]
[null,null,null,null,null,null,null,null,null,null,null,null,null,null,null,null,null,null,null,null,6454,"Bácsborsód","Bács-Kiskun"]
[null,null,null,null,null,null,null,null,null,null,null,null,null,null,null,null,null,null,null,null,6511,"Bácsszentgyörgy","Bács-Kiskun"]
[null,null,null,null,null,null,null,null,null,null,null,null,null,null,null,null,null,null,null,null,6425,"Bácsszőlős","Bács-Kiskun"]
[null,null,null,null,null,null,null,null,null,null,null,null,null,null,null,null,null,null,null,null,8261,"Badacsonytomaj","Veszprém"]
[null,null,null,null,null,null,null,null,null,null,null,null,null,null,null,null,null,null,null,null,8257,"Badacsonytomaj","Veszprém"]
[null,null,null,null,null,null,null,null,null,null,null,null,null,null,null,null,null,null,null,null,8258,"Badacsonytomaj","Veszprém"]
[null,null,null,null,null,null,null,null,null,null,null,null,null,null,null,null,null,null,null,null,8262,"Badacsonytördemic","Veszprém"]
[null,null,null,null,null,null,null,null,null,null,null,null,null,null,null,null,null,null,null,null,8263,"Badacsonytördemic","Veszprém"]
[null,null,null,null,null,null,null,null,null,null,null,null,null,null,null,null,null,null,null,null,2191,"Bag","Pest"]
[null,null,null,null,null,null,null,null,null,null,null,null,null,null,null,null,null,null,null,null,4286,"Bagamér","Hajdú-Bihar"]
[null,null,null,null,null,null,null,null,null,null,null,null,null,null,null,null,null,null,null,null,8977,"Baglad","Zala"]
[null,null,null,null,null,null,null,null,null,null,null,null,null,null,null,null,null,null,null,null,8992,"Bagod","Zala"]
[null,null,null,null,null,null,null,null,null,null,null,null,null,null,null,null,null,null,null,null,9145,"Bágyogszovát","Győr-Moson-Sopron"]
[null,null,null,null,null,null,null,null,null,null,null,null,null,null,null,null,null,null,null,null,2836,"Baj","Komárom-Esztergom"]
[null,null,null,null,null,null,null,null,null,null,null,null,null,null,null,null,null,null,null,null,6503,"Baja","Bács-Kiskun"]
[null,null,null,null,null,null,null,null,null,null,null,null,null,null,null,null,null,null,null,null,6500,"Baja","Bács-Kiskun"]
[null,null,null,null,null,null,null,null,null,null,null,null,null,null,null,null,null,null,null,null,9944,"Bajánsenye","Vas"]
[null,null,null,null,null,null,null,null,null,null,null,null,null,null,null,null,null,null,null,null,2525,"Bajna","Komárom-Esztergom"]
[null,null,null,null,null,null,null,null,null,null,null,null,null,null,null,null,null,null,null,null,2533,"Bajót","Komárom-Esztergom"]
[null,null,null,null,null,null,null,null,null,null,null,null,null,null,null,null,null,null,null,null,8945,"Bak","Zala"]
[null,null,null,null,null,null,null,null,null,null,null,null,null,null,null,null,null,null,null,null,7585,"Bakháza","Somogy"]
[null,null,null,null,null,null,null,null,null,null,null,null,null,null,null,null,null,null,null,null,7393,"Bakóca","Baranya"]
[null,null,null,null,null,null,null,null,null,null,null,null,null,null,null,null,null,null,null,null,4164,"Bakonszeg","Hajdú-Bihar"]
[null,null,null,null,null,null,null,null,null,null,null,null,null,null,null,null,null,null,null,null,7675,"Bakonya","Baranya"]
[null,null,null,null,null,null,null,null,null,null,null,null,null,null,null,null,null,null,null,null,2885,"Bakonybánk","Komárom-Esztergom"]
[null,null,null,null,null,null,null,null,null,null,null,null,null,null,null,null,null,null,null,null,8427,"Bakonybél","Veszprém"]
[null,null,null,null,null,null,null,null,null,null,null,null,null,null,null,null,null,null,null,null,8056,"Bakonycsernye","Fejér"]
[null,null,null,null,null,null,null,null,null,null,null,null,null,null,null,null,null,null,null,null,8433,"Bakonygyirót","Veszprém"]
[null,null,null,null,null,null,null,null,null,null,null,null,null,null,null,null,null,null,null,null,8581,"Bakonyjákó","Veszprém"]
[null,null,null,null,null,null,null,null,null,null,null,null,null,null,null,null,null,null,null,null,8571,"Bakonykoppány","Veszprém"]
[null,null,null,null,null,null,null,null,null,null,null,null,null,null,null,null,null,null,null,null,8045,"Bakonykúti","Fejér"]
[null,null,null,null,null,null,null,null,null,null,null,null,null,null,null,null,null,null,null,null,8422,"Bakonynána","Veszprém"]
[null,null,null,null,null,null,null,null,null,null,null,null,null,null,null,null,null,null,null,null,8418,"Bakonyoszlop","Veszprém"]
[null,null,null,null,null,null,null,null,null,null,null,null,null,null,null,null,null,null,null,null,9088,"Bakonypéterd","Győr-Moson-Sopron"]
[null,null,null,null,null,null,null,null,null,null,null,null,null,null,null,null,null,null,null,null,8457,"Bakonypölöske","Veszprém"]
[null,null,null,null,null,null,null,null,null,null,null,null,null,null,null,null,null,null,null,null,8557,"Bakonyság","Veszprém"]
[null,null,null,null,null,null,null,null,null,null,null,null,null,null,null,null,null,null,null,null,2861,"Bakonysárkány","Komárom-Esztergom"]
[null,null,null,null,null,null,null,null,null,null,null,null,null,null,null,null,null,null,null,null,8557,"Bakonyszentiván","Veszprém"]
[null,null,null,null,null,null,null,null,null,null,null,null,null,null,null,null,null,null,null,null,8430,"Bakonyszentkirály","Veszprém"]
[null,null,null,null,null,null,null,null,null,null,null,null,null,null,null,null,null,null,null,null,8431,"Bakonyszentlászló","Veszprém"]
[null,null,null,null,null,null,null,null,null,null,null,null,null,null,null,null,null,null,null,null,2884,"Bakonyszombathely","Komárom-Esztergom"]
[null,null,null,null,null,null,null,null,null,null,null,null,null,null,null,null,null,null,null,null,8572,"Bakonyszücs","Veszprém"]
[null,null,null,null,null,null,null,null,null,null,null,null,null,null,null,null,null,null,null,null,8555,"Bakonytamási","Veszprém"]
[null,null,null,null,null,null,null,null,null,null,null,null,null,null,null,null,null,null,null,null,6768,"Baks","Csongrád"]
[null,null,null,null,null,null,null,null,null,null,null,null,null,null,null,null,null,null,null,null,7834,"Baksa","Baranya"]
[null,null,null,null,null,null,null,null,null,null,null,null,null,null,null,null,null,null,null,null,3836,"Baktakék","Borsod-Abaúj-Zemplén"]
[null,null,null,null,null,null,null,null,null,null,null,null,null,null,null,null,null,null,null,null,4561,"Baktalórántháza","Szabolcs-Szatmár-Bereg"]
[null,null,null,null,null,null,null,null,null,null,null,null,null,null,null,null,null,null,null,null,8946,"Baktüttös","Zala"]
[null,null,null,null,null,null,null,null,null,null,null,null,null,null,null,null,null,null,null,null,3780,"Balajt","Borsod-Abaúj-Zemplén"]
[null,null,null,null,null,null,null,null,null,null,null,null,null,null,null,null,null,null,null,null,2660,"Balassagyarmat","Nógrád"]
[null,null,null,null,null,null,null,null,null,null,null,null,null,null,null,null,null,null,null,null,6764,"Balástya","Csongrád"]
[null,null,null,null,null,null,null,null,null,null,null,null,null,null,null,null,null,null,null,null,3347,"Balaton","Heves"]
[null,null,null,null,null,null,null,null,null,null,null,null,null,null,null,null,null,null,null,null,8243,"Balatonakali","Veszprém"]
[null,null,null,null,null,null,null,null,null,null,null,null,null,null,null,null,null,null,null,null,8220,"Balatonalmádi","Veszprém"]
[null,null,null,null,null,null,null,null,null,null,null,null,null,null,null,null,null,null,null,null,8649,"Balatonberény","Somogy"]
[null,null,null,null,null,null,null,null,null,null,null,null,null,null,null,null,null,null,null,null,8691,"Balatonboglár","Somogy"]
[null,null,null,null,null,null,null,null,null,null,null,null,null,null,null,null,null,null,null,null,8630,"Balatonboglár","Somogy"]
[null,null,null,null,null,null,null,null,null,null,null,null,null,null,null,null,null,null,null,null,8272,"Balatoncsicsó","Veszprém"]
[null,null,null,null,null,null,null,null,null,null,null,null,null,null,null,null,null,null,null,null,8312,"Balatonederics","Veszprém"]
[null,null,null,null,null,null,null,null,null,null,null,null,null,null,null,null,null,null,null,null,8613,"Balatonendréd","Somogy"]
[null,null,null,null,null,null,null,null,null,null,null,null,null,null,null,null,null,null,null,null,8646,"Balatonfenyves","Somogy"]
[null,null,null,null,null,null,null,null,null,null,null,null,null,null,null,null,null,null,null,null,8164,"Balatonfőkajár","Veszprém"]
[null,null,null,null,null,null,null,null,null,null,null,null,null,null,null,null,null,null,null,null,8623,"Balatonföldvár","Somogy"]
[null,null,null,null,null,null,null,null,null,null,null,null,null,null,null,null,null,null,null,null,8236,"Balatonfüred","Veszprém"]
[null,null,null,null,null,null,null,null,null,null,null,null,null,null,null,null,null,null,null,null,8230,"Balatonfüred","Veszprém"]
[null,null,null,null,null,null,null,null,null,null,null,null,null,null,null,null,null,null,null,null,8184,"Balatonfűzfő","Veszprém"]
[null,null,null,null,null,null,null,null,null,null,null,null,null,null,null,null,null,null,null,null,8175,"Balatonfűzfő","Veszprém"]
[null,null,null,null,null,null,null,null,null,null,null,null,null,null,null,null,null,null,null,null,8313,"Balatongyörök","Zala"]
[null,null,null,null,null,null,null,null,null,null,null,null,null,null,null,null,null,null,null,null,8275,"Balatonhenye","Veszprém"]
[null,null,null,null,null,null,null,null,null,null,null,null,null,null,null,null,null,null,null,null,8172,"Balatonkenese","Veszprém"]
[null,null,null,null,null,null,null,null,null,null,null,null,null,null,null,null,null,null,null,null,8174,"Balatonkenese","Veszprém"]
[null,null,null,null,null,null,null,null,null,null,null,null,null,null,null,null,null,null,null,null,8648,"Balatonkeresztúr","Somogy"]
[null,null,null,null,null,null,null,null,null,null,null,null,null,null,null,null,null,null,null,null,8638,"Balatonlelle","Somogy"]
[null,null,null,null,null,null,null,null,null,null,null,null,null,null,null,null,null,null,null,null,8753,"Balatonmagyaród","Zala"]
[null,null,null,null,null,null,null,null,null,null,null,null,null,null,null,null,null,null,null,null,8647,"Balatonmáriafürdő","Somogy"]
[null,null,null,null,null,null,null,null,null,null,null,null,null,null,null,null,null,null,null,null,8637,"Balatonőszöd","Somogy"]
[null,null,null,null,null,null,null,null,null,null,null,null,null,null,null,null,null,null,null,null,8255,"Balatonrendes","Veszprém"]
[null,null,null,null,null,null,null,null,null,null,null,null,null,null,null,null,null,null,null,null,8651,"Balatonszabadi","Somogy"]
[null,null,null,null,null,null,null,null,null,null,null,null,null,null,null,null,null,null,null,null,8624,"Balatonszárszó","Somogy"]
[null,null,null,null,null,null,null,null,null,null,null,null,null,null,null,null,null,null,null,null,8636,"Balatonszemes","Somogy"]
[null,null,null,null,null,null,null,null,null,null,null,null,null,null,null,null,null,null,null,null,8710,"Balatonszentgyörgy","Somogy"]
[null,null,null,null,null,null,null,null,null,null,null,null,null,null,null,null,null,null,null,null,8252,"Balatonszepezd","Veszprém"]
[null,null,null,null,null,null,null,null,null,null,null,null,null,null,null,null,null,null,null,null,8233,"Balatonszőlős","Veszprém"]
[null,null,null,null,null,null,null,null,null,null,null,null,null,null,null,null,null,null,null,null,8242,"Balatonudvari","Veszprém"]
[null,null,null,null,null,null,null,null,null,null,null,null,null,null,null,null,null,null,null,null,8712,"Balatonújlak","Somogy"]
[null,null,null,null,null,null,null,null,null,null,null,null,null,null,null,null,null,null,null,null,8171,"Balatonvilágos","Veszprém"]
[null,null,null,null,null,null,null,null,null,null,null,null,null,null,null,null,null,null,null,null,8054,"Balinka","Fejér"]
[null,null,null,null,null,null,null,null,null,null,null,null,null,null,null,null,null,null,null,null,8055,"Balinka","Fejér"]
[null,null,null,null,null,null,null,null,null,null,null,null,null,null,null,null,null,null,null,null,4233,"Balkány","Szabolcs-Szatmár-Bereg"]
[null,null,null,null,null,null,null,null,null,null,null,null,null,null,null,null,null,null,null,null,6035,"Ballószög","Bács-Kiskun"]
[null,null,null,null,null,null,null,null,null,null,null,null,null,null,null,null,null,null,null,null,4060,"Balmazújváros","Hajdú-Bihar"]
[null,null,null,null,null,null,null,null,null,null,null,null,null,null,null,null,null,null,null,null,9771,"Balogunyom","Vas"]
[null,null,null,null,null,null,null,null,null,null,null,null,null,null,null,null,null,null,null,null,6412,"Balotaszállás","Bács-Kiskun"]
[null,null,null,null,null,null,null,null,null,null,null,null,null,null,null,null,null,null,null,null,4468,"Balsa","Szabolcs-Szatmár-Bereg"]
[null,null,null,null,null,null,null,null,null,null,null,null,null,null,null,null,null,null,null,null,8614,"Bálványos","Somogy"]
[null,null,null,null,null,null,null,null,null,null,null,null,null,null,null,null,null,null,null,null,2944,"Bana","Komárom-Esztergom"]
[null,null,null,null,null,null,null,null,null,null,null,null,null,null,null,null,null,null,null,null,8443,"Bánd","Veszprém"]
[null,null,null,null,null,null,null,null,null,null,null,null,null,null,null,null,null,null,null,null,7914,"Bánfa","Baranya"]
[null,null,null,null,null,null,null,null,null,null,null,null,null,null,null,null,null,null,null,null,3642,"Bánhorváti","Borsod-Abaúj-Zemplén"]
[null,null,null,null,null,null,null,null,null,null,null,null,null,null,null,null,null,null,null,null,2653,"Bánk","Nógrád"]
[null,null,null,null,null,null,null,null,null,null,null,null,null,null,null,null,null,null,null,null,8891,"Bánokszentgyörgy","Zala"]
[null,null,null,null,null,null,null,null,null,null,null,null,null,null,null,null,null,null,null,null,3654,"Bánréve","Borsod-Abaúj-Zemplén"]
[null,null,null,null,null,null,null,null,null,null,null,null,null,null,null,null,null,null,null,null,7711,"Bár","Baranya"]
[null,null,null,null,null,null,null,null,null,null,null,null,null,null,null,null,null,null,null,null,4937,"Barabás","Szabolcs-Szatmár-Bereg"]
[null,null,null,null,null,null,null,null,null,null,null,null,null,null,null,null,null,null,null,null,2427,"Baracs","Fejér"]
[null,null,null,null,null,null,null,null,null,null,null,null,null,null,null,null,null,null,null,null,2426,"Baracs","Fejér"]
[null,null,null,null,null,null,null,null,null,null,null,null,null,null,null,null,null,null,null,null,2471,"Baracska","Fejér"]
[null,null,null,null,null,null,null,null,null,null,null,null,null,null,null,null,null,null,null,null,4161,"Báránd","Hajdú-Bihar"]
[null,null,null,null,null,null,null,null,null,null,null,null,null,null,null,null,null,null,null,null,7841,"Baranyahidvég","Baranya"]
[null,null,null,null,null,null,null,null,null,null,null,null,null,null,null,null,null,null,null,null,7384,"Baranyajenő","Baranya"]
[null,null,null,null,null,null,null,null,null,null,null,null,null,null,null,null,null,null,null,null,7383,"Baranyaszentgyörgy","Baranya"]
[null,null,null,null,null,null,null,null,null,null,null,null,null,null,null,null,null,null,null,null,9169,"Barbacs","Győr-Moson-Sopron"]
[null,null,null,null,null,null,null,null,null,null,null,null,null,null,null,null,null,null,null,null,7557,"Barcs","Somogy"]
[null,null,null,null,null,null,null,null,null,null,null,null,null,null,null,null,null,null,null,null,7570,"Barcs","Somogy"]
[null,null,null,null,null,null,null,null,null,null,null,null,null,null,null,null,null,null,null,null,7478,"Bárdudvarnok","Somogy"]
[null,null,null,null,null,null,null,null,null,null,null,null,null,null,null,null,null,null,null,null,8948,"Barlahida","Zala"]
[null,null,null,null,null,null,null,null,null,null,null,null,null,null,null,null,null,null,null,null,3126,"Bárna","Nógrád"]
[null,null,null,null,null,null,null,null,null,null,null,null,null,null,null,null,null,null,null,null,8291,"Barnag","Veszprém"]
[null,null,null,null,null,null,null,null,null,null,null,null,null,null,null,null,null,null,null,null,2883,"Bársonyos","Komárom-Esztergom"]
[null,null,null,null,null,null,null,null,null,null,null,null,null,null,null,null,null,null,null,null,7923,"Basal","Baranya"]
[null,null,null,null,null,null,null,null,null,null,null,null,null,null,null,null,null,null,null,null,3881,"Baskó","Borsod-Abaúj-Zemplén"]
[null,null,null,null,null,null,null,null,null,null,null,null,null,null,null,null,null,null,null,null,7149,"Báta","Tolna"]
[null,null,null,null,null,null,null,null,null,null,null,null,null,null,null,null,null,null,null,null,7164,"Bátaapáti","Tolna"]
[null,null,null,null,null,null,null,null,null,null,null,null,null,null,null,null,null,null,null,null,7140,"Bátaszék","Tolna"]
[null,null,null,null,null,null,null,null,null,null,null,null,null,null,null,null,null,null,null,null,7258,"Baté","Somogy"]
[null,null,null,null,null,null,null,null,null,null,null,null,null,null,null,null,null,null,null,null,6528,"Bátmonostor","Bács-Kiskun"]
[null,null,null,null,null,null,null,null,null,null,null,null,null,null,null,null,null,null,null,null,3078,"Bátonyterenye","Nógrád"]
[null,null,null,null,null,null,null,null,null,null,null,null,null,null,null,null,null,null,null,null,3070,"Bátonyterenye","Nógrád"]
[null,null,null,null,null,null,null,null,null,null,null,null,null,null,null,null,null,null,null,null,3151,"Bátonyterenye","Nógrád"]
[null,null,null,null,null,null,null,null,null,null,null,null,null,null,null,null,null,null,null,null,3336,"Bátor","Heves"]
[null,null,null,null,null,null,null,null,null,null,null,null,null,null,null,null,null,null,null,null,4343,"Bátorliget","Szabolcs-Szatmár-Bereg"]
[null,null,null,null,null,null,null,null,null,null,null,null,null,null,null,null,null,null,null,null,5830,"Battonya","Békés"]
[null,null,null,null,null,null,null,null,null,null,null,null,null,null,null,null,null,null,null,null,6351,"Bátya","Bács-Kiskun"]
[null,null,null,null,null,null,null,null,null,null,null,null,null,null,null,null,null,null,null,null,8797,"Batyk","Zala"]
[null,null,null,null,null,null,null,null,null,null,null,null,null,null,null,null,null,null,null,null,8887,"Bázakerettye","Zala"]
[null,null,null,null,null,null,null,null,null,null,null,null,null,null,null,null,null,null,null,null,8352,"Bazsi","Veszprém"]
[null,null,null,null,null,null,null,null,null,null,null,null,null,null,null,null,null,null,null,null,8565,"Béb","Veszprém"]
[null,null,null,null,null,null,null,null,null,null,null,null,null,null,null,null,null,null,null,null,8866,"Becsehely","Zala"]
[null,null,null,null,null,null,null,null,null,null,null,null,null,null,null,null,null,null,null,null,2693,"Becske","Nógrád"]
[null,null,null,null,null,null,null,null,null,null,null,null,null,null,null,null,null,null,null,null,3768,"Becskeháza","Borsod-Abaúj-Zemplén"]
[null,null,null,null,null,null,null,null,null,null,null,null,null,null,null,null,null,null,null,null,8985,"Becsvölgye","Zala"]
[null,null,null,null,null,null,null,null,null,null,null,null,null,null,null,null,null,null,null,null,8666,"Bedegkér","Somogy"]
[null,null,null,null,null,null,null,null,null,null,null,null,null,null,null,null,null,null,null,null,4128,"Bedő","Hajdú-Bihar"]
[null,null,null,null,null,null,null,null,null,null,null,null,null,null,null,null,null,null,null,null,9683,"Bejcgyertyános","Vas"]
[null,null,null,null,null,null,null,null,null,null,null,null,null,null,null,null,null,null,null,null,8515,"Békás","Veszprém"]
[null,null,null,null,null,null,null,null,null,null,null,null,null,null,null,null,null,null,null,null,3903,"Bekecs","Borsod-Abaúj-Zemplén"]
[null,null,null,null,null,null,null,null,null,null,null,null,null,null,null,null,null,null,null,null,5630,"Békés","Békés"]
[null,null,null,null,null,null,null,null,null,null,null,null,null,null,null,null,null,null,null,null,5623,"Békéscsaba","Békés"]
[null,null,null,null,null,null,null,null,null,null,null,null,null,null,null,null,null,null,null,null,5671,"Békéscsaba","Békés"]
[null,null,null,null,null,null,null,null,null,null,null,null,null,null,null,null,null,null,null,null,5600,"Békéscsaba","Békés"]
[null,null,null,null,null,null,null,null,null,null,null,null,null,null,null,null,null,null,null,null,5946,"Békéssámson","Békés"]
[null,null,null,null,null,null,null,null,null,null,null,null,null,null,null,null,null,null,null,null,5561,"Békésszentandrás","Békés"]
[null,null,null,null,null,null,null,null,null,null,null,null,null,null,null,null,null,null,null,null,3343,"Bekölce","Heves"]
[null,null,null,null,null,null,null,null,null,null,null,null,null,null,null,null,null,null,null,null,3346,"Bélapátfalva","Heves"]
[null,null,null,null,null,null,null,null,null,null,null,null,null,null,null,null,null,null,null,null,7589,"Bélavár","Somogy"]
[null,null,null,null,null,null,null,null,null,null,null,null,null,null,null,null,null,null,null,null,7061,"Belecska","Tolna"]
[null,null,null,null,null,null,null,null,null,null,null,null,null,null,null,null,null,null,null,null,9343,"Beled","Győr-Moson-Sopron"]
[null,null,null,null,null,null,null,null,null,null,null,null,null,null,null,null,null,null,null,null,7543,"Beleg","Somogy"]
[null,null,null,null,null,null,null,null,null,null,null,null,null,null,null,null,null,null,null,null,8855,"Belezna","Zala"]
[null,null,null,null,null,null,null,null,null,null,null,null,null,null,null,null,null,null,null,null,5643,"Bélmegyer","Békés"]
[null,null,null,null,null,null,null,null,null,null,null,null,null,null,null,null,null,null,null,null,2455,"Beloiannisz","Fejér"]
[null,null,null,null,null,null,null,null,null,null,null,null,null,null,null,null,null,null,null,null,8978,"Belsősárd","Zala"]
[null,null,null,null,null,null,null,null,null,null,null,null,null,null,null,null,null,null,null,null,7747,"Belvárdgyula","Baranya"]
[null,null,null,null,null,null,null,null,null,null,null,null,null,null,null,null,null,null,null,null,4643,"Benk","Szabolcs-Szatmár-Bereg"]
[null,null,null,null,null,null,null,null,null,null,null,null,null,null,null,null,null,null,null,null,2216,"Bénye","Pest"]
[null,null,null,null,null,null,null,null,null,null,null,null,null,null,null,null,null,null,null,null,3045,"Bér","Nógrád"]
[null,null,null,null,null,null,null,null,null,null,null,null,null,null,null,null,null,null,null,null,9831,"Bérbaltavár","Vas"]
[null,null,null,null,null,null,null,null,null,null,null,null,null,null,null,null,null,null,null,null,2687,"Bercel","Nógrád"]
[null,null,null,null,null,null,null,null,null,null,null,null,null,null,null,null,null,null,null,null,4934,"Beregdaróc","Szabolcs-Szatmár-Bereg"]
[null,null,null,null,null,null,null,null,null,null,null,null,null,null,null,null,null,null,null,null,4933,"Beregsurány","Szabolcs-Szatmár-Bereg"]
[null,null,null,null,null,null,null,null,null,null,null,null,null,null,null,null,null,null,null,null,4116,"Berekböszörmény","Hajdú-Bihar"]
[null,null,null,null,null,null,null,null,null,null,null,null,null,null,null,null,null,null,null,null,5309,"Berekfürdő","Jász-Nagykun-Szolnok"]
[null,null,null,null,null,null,null,null,null,null,null,null,null,null,null,null,null,null,null,null,7827,"Beremend","Baranya"]
[null,null,null,null,null,null,null,null,null,null,null,null,null,null,null,null,null,null,null,null,3704,"Berente","Borsod-Abaúj-Zemplén"]
[null,null,null,null,null,null,null,null,null,null,null,null,null,null,null,null,null,null,null,null,3834,"Beret","Borsod-Abaúj-Zemplén"]
[null,null,null,null,null,null,null,null,null,null,null,null,null,null,null,null,null,null,null,null,4103,"Berettyóújfalu","Hajdú-Bihar"]
[null,null,null,null,null,null,null,null,null,null,null,null,null,null,null,null,null,null,null,null,4100,"Berettyóújfalu","Hajdú-Bihar"]
[null,null,null,null,null,null,null,null,null,null,null,null,null,null,null,null,null,null,null,null,8182,"Berhida","Veszprém"]
[null,null,null,null,null,null,null,null,null,null,null,null,null,null,null,null,null,null,null,null,8181,"Berhida","Veszprém"]
[null,null,null,null,null,null,null,null,null,null,null,null,null,null,null,null,null,null,null,null,2641,"Berkenye","Nógrád"]
[null,null,null,null,null,null,null,null,null,null,null,null,null,null,null,null,null,null,null,null,7664,"Berkesd","Baranya"]
[null,null,null,null,null,null,null,null,null,null,null,null,null,null,null,null,null,null,null,null,4521,"Berkesz","Szabolcs-Szatmár-Bereg"]
[null,null,null,null,null,null,null,null,null,null,null,null,null,null,null,null,null,null,null,null,2639,"Bernecebaráti","Pest"]
[null,null,null,null,null,null,null,null,null,null,null,null,null,null,null,null,null,null,null,null,3575,"Berzék","Borsod-Abaúj-Zemplén"]
[null,null,null,null,null,null,null,null,null,null,null,null,null,null,null,null,null,null,null,null,7516,"Berzence","Somogy"]
[null,null,null,null,null,null,null,null,null,null,null,null,null,null,null,null,null,null,null,null,7838,"Besence","Baranya"]
[null,null,null,null,null,null,null,null,null,null,null,null,null,null,null,null,null,null,null,null,4557,"Besenyőd","Szabolcs-Szatmár-Bereg"]
[null,null,null,null,null,null,null,null,null,null,null,null,null,null,null,null,null,null,null,null,3373,"Besenyőtelek","Heves"]
[null,null,null,null,null,null,null,null,null,null,null,null,null,null,null,null,null,null,null,null,5071,"Besenyszög","Jász-Nagykun-Szolnok"]
[null,null,null,null,null,null,null,null,null,null,null,null,null,null,null,null,null,null,null,null,2456,"Besnyő","Fejér"]
[null,null,null,null,null,null,null,null,null,null,null,null,null,null,null,null,null,null,null,null,4488,"Beszterec","Szabolcs-Szatmár-Bereg"]
[null,null,null,null,null,null,null,null,null,null,null,null,null,null,null,null,null,null,null,null,7782,"Bezedek","Baranya"]
[null,null,null,null,null,null,null,null,null,null,null,null,null,null,null,null,null,null,null,null,9223,"Bezenye","Győr-Moson-Sopron"]
[null,null,null,null,null,null,null,null,null,null,null,null,null,null,null,null,null,null,null,null,8934,"Bezeréd","Zala"]
[null,null,null,null,null,null,null,null,null,null,null,null,null,null,null,null,null,null,null,null,9162,"Bezi","Győr-Moson-Sopron"]
[null,null,null,null,null,null,null,null,null,null,null,null,null,null,null,null,null,null,null,null,2051,"Biatorbágy","Pest"]
[null,null,null,null,null,null,null,null,null,null,null,null,null,null,null,null,null,null,null,null,7671,"Bicsérd","Baranya"]
[null,null,null,null,null,null,null,null,null,null,null,null,null,null,null,null,null,null,null,null,2060,"Bicske","Fejér"]
[null,null,null,null,null,null,null,null,null,null,null,null,null,null,null,null,null,null,null,null,4175,"Bihardancsháza","Hajdú-Bihar"]
[null,null,null,null,null,null,null,null,null,null,null,null,null,null,null,null,null,null,null,null,4110,"Biharkeresztes","Hajdú-Bihar"]
[null,null,null,null,null,null,null,null,null,null,null,null,null,null,null,null,null,null,null,null,4172,"Biharnagybajom","Hajdú-Bihar"]
[null,null,null,null,null,null,null,null,null,null,null,null,null,null,null,null,null,null,null,null,4174,"Bihartorda","Hajdú-Bihar"]
[null,null,null,null,null,null,null,null,null,null,null,null,null,null,null,null,null,null,null,null,5538,"Biharugra","Békés"]
[null,null,null,null,null,null,null,null,null,null,null,null,null,null,null,null,null,null,null,null,7043,"Bikács","Tolna"]
[null,null,null,null,null,null,null,null,null,null,null,null,null,null,null,null,null,null,null,null,7346,"Bikal","Baranya"]
[null,null,null,null,null,null,null,null,null,null,null,null,null,null,null,null,null,null,null,null,4235,"Biri","Szabolcs-Szatmár-Bereg"]
[null,null,null,null,null,null,null,null,null,null,null,null,null,null,null,null,null,null,null,null,7747,"Birján","Baranya"]
[null,null,null,null,null,null,null,null,null,null,null,null,null,null,null,null,null,null,null,null,7811,"Bisse","Baranya"]
[null,null,null,null,null,null,null,null,null,null,null,null,null,null,null,null,null,null,null,null,9625,"Bő","Vas"]
[null,null,null,null,null,null,null,null,null,null,null,null,null,null,null,null,null,null,null,null,9542,"Boba","Zala"]
[null,null,null,null,null,null,null,null,null,null,null,null,null,null,null,null,null,null,null,null,8943,"Bocfölde","Heves"]
[null,null,null,null,null,null,null,null,null,null,null,null,null,null,null,null,null,null,null,null,3368,"Boconád","Bács-Kiskun"]
[null,null,null,null,null,null,null,null,null,null,null,null,null,null,null,null,null,null,null,null,3574,"Bőcs","Zala"]
[null,null,null,null,null,null,null,null,null,null,null,null,null,null,null,null,null,null,null,null,6235,"Bócsa","Hajdú-Bihar"]
[null,null,null,null,null,null,null,null,null,null,null,null,null,null,null,null,null,null,null,null,8776,"Bocska","Baranya"]
[null,null,null,null,null,null,null,null,null,null,null,null,null,null,null,null,null,null,null,null,4241,"Bocskaikert","Fejér"]
[null,null,null,null,null,null,null,null,null,null,null,null,null,null,null,null,null,null,null,null,7672,"Boda","Fejér"]
[null,null,null,null,null,null,null,null,null,null,null,null,null,null,null,null,null,null,null,null,8053,"Bodajk","Baranya"]
[null,null,null,null,null,null,null,null,null,null,null,null,null,null,null,null,null,null,null,null,8991,"Böde","Győr-Moson-Sopron"]
[null,null,null,null,null,null,null,null,null,null,null,null,null,null,null,null,null,null,null,null,8969,"Bödeháza","Heves"]
[null,null,null,null,null,null,null,null,null,null,null,null,null,null,null,null,null,null,null,null,8085,"Bodmér","Veszprém"]
[null,null,null,null,null,null,null,null,null,null,null,null,null,null,null,null,null,null,null,null,7394,"Bodolyabér","Somogy"]
[null,null,null,null,null,null,null,null,null,null,null,null,null,null,null,null,null,null,null,null,9134,"Bodonhely","Borsod-Abaúj-Zemplén"]
[null,null,null,null,null,null,null,null,null,null,null,null,null,null,null,null,null,null,null,null,3243,"Bodony","Borsod-Abaúj-Zemplén"]
[null,null,null,null,null,null,null,null,null,null,null,null,null,null,null,null,null,null,null,null,8471,"Bodorfa","Borsod-Abaúj-Zemplén"]
[null,null,null,null,null,null,null,null,null,null,null,null,null,null,null,null,null,null,null,null,7439,"Bodrog","Borsod-Abaúj-Zemplén"]
[null,null,null,null,null,null,null,null,null,null,null,null,null,null,null,null,null,null,null,null,3987,"Bodroghalom","Borsod-Abaúj-Zemplén"]
[null,null,null,null,null,null,null,null,null,null,null,null,null,null,null,null,null,null,null,null,3916,"Bodrogkeresztúr","Borsod-Abaúj-Zemplén"]
[null,null,null,null,null,null,null,null,null,null,null,null,null,null,null,null,null,null,null,null,3917,"Bodrogkisfalud","Borsod-Abaúj-Zemplén"]
[null,null,null,null,null,null,null,null,null,null,null,null,null,null,null,null,null,null,null,null,3943,"Bodrogolaszi","Borsod-Abaúj-Zemplén"]
[null,null,null,null,null,null,null,null,null,null,null,null,null,null,null,null,null,null,null,null,3768,"Bódvalenke","Baranya"]
[null,null,null,null,null,null,null,null,null,null,null,null,null,null,null,null,null,null,null,null,3764,"Bódvarákó","Baranya"]
[null,null,null,null,null,null,null,null,null,null,null,null,null,null,null,null,null,null,null,null,3763,"Bódvaszilas","Baranya"]
[null,null,null,null,null,null,null,null,null,null,null,null,null,null,null,null,null,null,null,null,3412,"Bogács","Tolna"]
[null,null,null,null,null,null,null,null,null,null,null,null,null,null,null,null,null,null,null,null,7742,"Bogád","Győr-Moson-Sopron"]
[null,null,null,null,null,null,null,null,null,null,null,null,null,null,null,null,null,null,null,null,7836,"Bogádmindszent","Hajdú-Bihar"]
[null,null,null,null,null,null,null,null,null,null,null,null,null,null,null,null,null,null,null,null,7966,"Bogdása","Zala"]
[null,null,null,null,null,null,null,null,null,null,null,null,null,null,null,null,null,null,null,null,9612,"Bögöt","Komárom-Esztergom"]
[null,null,null,null,null,null,null,null,null,null,null,null,null,null,null,null,null,null,null,null,9675,"Bögöte","Nógrád"]
[null,null,null,null,null,null,null,null,null,null,null,null,null,null,null,null,null,null,null,null,7132,"Bogyiszló","Heves"]
[null,null,null,null,null,null,null,null,null,null,null,null,null,null,null,null,null,null,null,null,9324,"Bogyoszló","Baranya"]
[null,null,null,null,null,null,null,null,null,null,null,null,null,null,null,null,null,null,null,null,8719,"Böhönye","Borsod-Abaúj-Zemplén"]
[null,null,null,null,null,null,null,null,null,null,null,null,null,null,null,null,null,null,null,null,4114,"Bojt","Borsod-Abaúj-Zemplén"]
[null,null,null,null,null,null,null,null,null,null,null,null,null,null,null,null,null,null,null,null,8741,"Bókaháza","Borsod-Abaúj-Zemplén"]
[null,null,null,null,null,null,null,null,null,null,null,null,null,null,null,null,null,null,null,null,2855,"Bokod","Somogy"]
[null,null,null,null,null,null,null,null,null,null,null,null,null,null,null,null,null,null,null,null,4231,"Bököny","Somogy"]
[null,null,null,null,null,null,null,null,null,null,null,null,null,null,null,null,null,null,null,null,3066,"Bokor","Baranya"]
[null,null,null,null,null,null,null,null,null,null,null,null,null,null,null,null,null,null,null,null,7025,"Bölcske","Zala"]
[null,null,null,null,null,null,null,null,null,null,null,null,null,null,null,null,null,null,null,null,3016,"Boldog","Somogy"]
[null,null,null,null,null,null,null,null,null,null,null,null,null,null,null,null,null,null,null,null,7937,"Boldogasszonyfa","Tolna"]
[null,null,null,null,null,null,null,null,null,null,null,null,null,null,null,null,null,null,null,null,3884,"Boldogkőújfalu","Tolna"]
[null,null,null,null,null,null,null,null,null,null,null,null,null,null,null,null,null,null,null,null,3885,"Boldogkőváralja","Tolna"]
[null,null,null,null,null,null,null,null,null,null,null,null,null,null,null,null,null,null,null,null,3794,"Boldva","Csongrád"]
[null,null,null,null,null,null,null,null,null,null,null,null,null,null,null,null,null,null,null,null,7517,"Bolhás","Vas"]
[null,null,null,null,null,null,null,null,null,null,null,null,null,null,null,null,null,null,null,null,7586,"Bolhó","Baranya"]
[null,null,null,null,null,null,null,null,null,null,null,null,null,null,null,null,null,null,null,null,7754,"Bóly","Bács-Kiskun"]
[null,null,null,null,null,null,null,null,null,null,null,null,null,null,null,null,null,null,null,null,8992,"Boncodfölde","Zala"]
[null,null,null,null,null,null,null,null,null,null,null,null,null,null,null,null,null,null,null,null,7281,"Bonnya","Borsod-Abaúj-Zemplén"]
[null,null,null,null,null,null,null,null,null,null,null,null,null,null,null,null,null,null,null,null,9073,"Bőny","Borsod-Abaúj-Zemplén"]
[null,null,null,null,null,null,null,null,null,null,null,null,null,null,null,null,null,null,null,null,7187,"Bonyhád","Borsod-Abaúj-Zemplén"]
[null,null,null,null,null,null,null,null,null,null,null,null,null,null,null,null,null,null,null,null,7150,"Bonyhád","Borsod-Abaúj-Zemplén"]
[null,null,null,null,null,null,null,null,null,null,null,null,null,null,null,null,null,null,null,null,7158,"Bonyhádvarasd","Borsod-Abaúj-Zemplén"]
[null,null,null,null,null,null,null,null,null,null,null,null,null,null,null,null,null,null,null,null,9152,"Börcs","Borsod-Abaúj-Zemplén"]
[null,null,null,null,null,null,null,null,null,null,null,null,null,null,null,null,null,null,null,null,6795,"Bordány","Borsod-Abaúj-Zemplén"]
[null,null,null,null,null,null,null,null,null,null,null,null,null,null,null,null,null,null,null,null,9554,"Borgáta","Nógrád"]
[null,null,null,null,null,null,null,null,null,null,null,null,null,null,null,null,null,null,null,null,7756,"Borjád","Veszprém"]
[null,null,null,null,null,null,null,null,null,null,null,null,null,null,null,null,null,null,null,null,6445,"Borota","Veszprém"]
[null,null,null,null,null,null,null,null,null,null,null,null,null,null,null,null,null,null,null,null,8885,"Borsfa","Baranya"]
[null,null,null,null,null,null,null,null,null,null,null,null,null,null,null,null,null,null,null,null,3658,"Borsodbóta","Szabolcs-Szatmár-Bereg"]
[null,null,null,null,null,null,null,null,null,null,null,null,null,null,null,null,null,null,null,null,3426,"Borsodgeszt","Baranya"]
[null,null,null,null,null,null,null,null,null,null,null,null,null,null,null,null,null,null,null,null,3462,"Borsodivánka","Vas"]
[null,null,null,null,null,null,null,null,null,null,null,null,null,null,null,null,null,null,null,null,3672,"Borsodnádasd","Vas"]
[null,null,null,null,null,null,null,null,null,null,null,null,null,null,null,null,null,null,null,null,3671,"Borsodnádasd","Borsod-Abaúj-Zemplén"]
[null,null,null,null,null,null,null,null,null,null,null,null,null,null,null,null,null,null,null,null,3623,"Borsodszentgyörgy","Vas"]
[null,null,null,null,null,null,null,null,null,null,null,null,null,null,null,null,null,null,null,null,3796,"Borsodszirák","Borsod-Abaúj-Zemplén"]
[null,null,null,null,null,null,null,null,null,null,null,null,null,null,null,null,null,null,null,null,2644,"Borsosberény","Zala"]
[null,null,null,null,null,null,null,null,null,null,null,null,null,null,null,null,null,null,null,null,8479,"Borszörcsök","Zala"]
[null,null,null,null,null,null,null,null,null,null,null,null,null,null,null,null,null,null,null,null,8428,"Borzavár","Vas"]
[null,null,null,null,null,null,null,null,null,null,null,null,null,null,null,null,null,null,null,null,8772,"Börzönce","Vas"]
[null,null,null,null,null,null,null,null,null,null,null,null,null,null,null,null,null,null,null,null,9167,"Bősárkány","Somogy"]
[null,null,null,null,null,null,null,null,null,null,null,null,null,null,null,null,null,null,null,null,7811,"Bosta","Szabolcs-Szatmár-Bereg"]
[null,null,null,null,null,null,null,null,null,null,null,null,null,null,null,null,null,null,null,null,7475,"Bőszénfa","Tolna"]
[null,null,null,null,null,null,null,null,null,null,null,null,null,null,null,null,null,null,null,null,4955,"Botpalád","Győr-Moson-Sopron"]
[null,null,null,null,null,null,null,null,null,null,null,null,null,null,null,null,null,null,null,null,7900,"Botykapeterd","Győr-Moson-Sopron"]
[null,null,null,null,null,null,null,null,null,null,null,null,null,null,null,null,null,null,null,null,9727,"Bozsok","Zala"]
[null,null,null,null,null,null,null,null,null,null,null,null,null,null,null,null,null,null,null,null,3994,"Bózsva","Győr-Moson-Sopron"]
[null,null,null,null,null,null,null,null,null,null,null,null,null,null,null,null,null,null,null,null,9752,"Bozzai","Somogy"]
[null,null,null,null,null,null,null,null,null,null,null,null,null,null,null,null,null,null,null,null,5527,"Bucsa","Békés"]
[null,null,null,null,null,null,null,null,null,null,null,null,null,null,null,null,null,null,null,null,9792,"Bucsu","Vas"]
[null,null,null,null,null,null,null,null,null,null,null,null,null,null,null,null,null,null,null,null,8925,"Bucsuszentlászló","Zala"]
[null,null,null,null,null,null,null,null,null,null,null,null,null,null,null,null,null,null,null,null,8893,"Bucsuta","Zala"]
[null,null,null,null,null,null,null,null,null,null,null,null,null,null,null,null,null,null,null,null,2093,"Budajenő","Pest"]
[null,null,null,null,null,null,null,null,null,null,null,null,null,null,null,null,null,null,null,null,2011,"Budakalász","Pest"]
[null,null,null,null,null,null,null,null,null,null,null,null,null,null,null,null,null,null,null,null,2092,"Budakeszi","Pest"]
[null,null,null,null,null,null,null,null,null,null,null,null,null,null,null,null,null,null,null,null,2040,"Budaörs","Pest"]
[null,null,null,null,null,null,null,null,null,null,null,null,null,null,null,null,null,null,null,null,1069,"Budapest"]
[null,null,null,null,null,null,null,null,null,null,null,null,null,null,null,null,null,null,null,null,1011,"Budapest"]
[null,null,null,null,null,null,null,null,null,null,null,null,null,null,null,null,null,null,null,null,1012,"Budapest"]
[null,null,null,null,null,null,null,null,null,null,null,null,null,null,null,null,null,null,null,null,1013,"Budapest"]
[null,null,null,null,null,null,null,null,null,null,null,null,null,null,null,null,null,null,null,null,1014,"Budapest"]
[null,null,null,null,null,null,null,null,null,null,null,null,null,null,null,null,null,null,null,null,1015,"Budapest"]
[null,null,null,null,null,null,null,null,null,null,null,null,null,null,null,null,null,null,null,null,1016,"Budapest"]
[null,null,null,null,null,null,null,null,null,null,null,null,null,null,null,null,null,null,null,null,1021,"Budapest"]
[null,null,null,null,null,null,null,null,null,null,null,null,null,null,null,null,null,null,null,null,1022,"Budapest"]
[null,null,null,null,null,null,null,null,null,null,null,null,null,null,null,null,null,null,null,null,1023,"Budapest"]
[null,null,null,null,null,null,null,null,null,null,null,null,null,null,null,null,null,null,null,null,1024,"Budapest"]
[null,null,null,null,null,null,null,null,null,null,null,null,null,null,null,null,null,null,null,null,1025,"Budapest"]
[null,null,null,null,null,null,null,null,null,null,null,null,null,null,null,null,null,null,null,null,1026,"Budapest"]
[null,null,null,null,null,null,null,null,null,null,null,null,null,null,null,null,null,null,null,null,1027,"Budapest"]
[null,null,null,null,null,null,null,null,null,null,null,null,null,null,null,null,null,null,null,null,1028,"Budapest"]
[null,null,null,null,null,null,null,null,null,null,null,null,null,null,null,null,null,null,null,null,1029,"Budapest"]
[null,null,null,null,null,null,null,null,null,null,null,null,null,null,null,null,null,null,null,null,1031,"Budapest"]
[null,null,null,null,null,null,null,null,null,null,null,null,null,null,null,null,null,null,null,null,1032,"Budapest"]
[null,null,null,null,null,null,null,null,null,null,null,null,null,null,null,null,null,null,null,null,1033,"Budapest"]
[null,null,null,null,null,null,null,null,null,null,null,null,null,null,null,null,null,null,null,null,1034,"Budapest"]
[null,null,null,null,null,null,null,null,null,null,null,null,null,null,null,null,null,null,null,null,1035,"Budapest"]
[null,null,null,null,null,null,null,null,null,null,null,null,null,null,null,null,null,null,null,null,1036,"Budapest"]
[null,null,null,null,null,null,null,null,null,null,null,null,null,null,null,null,null,null,null,null,1037,"Budapest"]
[null,null,null,null,null,null,null,null,null,null,null,null,null,null,null,null,null,null,null,null,1038,"Budapest"]
[null,null,null,null,null,null,null,null,null,null,null,null,null,null,null,null,null,null,null,null,1039,"Budapest"]
[null,null,null,null,null,null,null,null,null,null,null,null,null,null,null,null,null,null,null,null,1041,"Budapest"]
[null,null,null,null,null,null,null,null,null,null,null,null,null,null,null,null,null,null,null,null,1042,"Budapest"]
[null,null,null,null,null,null,null,null,null,null,null,null,null,null,null,null,null,null,null,null,1043,"Budapest"]
[null,null,null,null,null,null,null,null,null,null,null,null,null,null,null,null,null,null,null,null,1044,"Budapest"]
[null,null,null,null,null,null,null,null,null,null,null,null,null,null,null,null,null,null,null,null,1045,"Budapest"]
[null,null,null,null,null,null,null,null,null,null,null,null,null,null,null,null,null,null,null,null,1046,"Budapest"]
[null,null,null,null,null,null,null,null,null,null,null,null,null,null,null,null,null,null,null,null,1047,"Budapest"]
[null,null,null,null,null,null,null,null,null,null,null,null,null,null,null,null,null,null,null,null,1048,"Budapest"]
[null,null,null,null,null,null,null,null,null,null,null,null,null,null,null,null,null,null,null,null,1051,"Budapest"]
[null,null,null,null,null,null,null,null,null,null,null,null,null,null,null,null,null,null,null,null,1052,"Budapest"]
[null,null,null,null,null,null,null,null,null,null,null,null,null,null,null,null,null,null,null,null,1053,"Budapest"]
[null,null,null,null,null,null,null,null,null,null,null,null,null,null,null,null,null,null,null,null,1054,"Budapest"]
[null,null,null,null,null,null,null,null,null,null,null,null,null,null,null,null,null,null,null,null,1055,"Budapest"]
[null,null,null,null,null,null,null,null,null,null,null,null,null,null,null,null,null,null,null,null,1056,"Budapest"]
[null,null,null,null,null,null,null,null,null,null,null,null,null,null,null,null,null,null,null,null,1061,"Budapest"]
[null,null,null,null,null,null,null,null,null,null,null,null,null,null,null,null,null,null,null,null,1062,"Budapest"]
[null,null,null,null,null,null,null,null,null,null,null,null,null,null,null,null,null,null,null,null,1063,"Budapest"]
[null,null,null,null,null,null,null,null,null,null,null,null,null,null,null,null,null,null,null,null,1064,"Budapest"]
[null,null,null,null,null,null,null,null,null,null,null,null,null,null,null,null,null,null,null,null,1065,"Budapest"]
[null,null,null,null,null,null,null,null,null,null,null,null,null,null,null,null,null,null,null,null,1066,"Budapest"]
[null,null,null,null,null,null,null,null,null,null,null,null,null,null,null,null,null,null,null,null,1067,"Budapest"]
[null,null,null,null,null,null,null,null,null,null,null,null,null,null,null,null,null,null,null,null,1068,"Budapest"]
[null,null,null,null,null,null,null,null,null,null,null,null,null,null,null,null,null,null,null,null,1071,"Budapest"]
[null,null,null,null,null,null,null,null,null,null,null,null,null,null,null,null,null,null,null,null,1072,"Budapest"]
[null,null,null,null,null,null,null,null,null,null,null,null,null,null,null,null,null,null,null,null,1073,"Budapest"]
[null,null,null,null,null,null,null,null,null,null,null,null,null,null,null,null,null,null,null,null,1074,"Budapest"]
[null,null,null,null,null,null,null,null,null,null,null,null,null,null,null,null,null,null,null,null,1075,"Budapest"]
[null,null,null,null,null,null,null,null,null,null,null,null,null,null,null,null,null,null,null,null,1076,"Budapest"]
[null,null,null,null,null,null,null,null,null,null,null,null,null,null,null,null,null,null,null,null,1077,"Budapest"]
[null,null,null,null,null,null,null,null,null,null,null,null,null,null,null,null,null,null,null,null,1078,"Budapest"]
[null,null,null,null,null,null,null,null,null,null,null,null,null,null,null,null,null,null,null,null,1081,"Budapest"]
[null,null,null,null,null,null,null,null,null,null,null,null,null,null,null,null,null,null,null,null,1082,"Budapest"]
[null,null,null,null,null,null,null,null,null,null,null,null,null,null,null,null,null,null,null,null,1083,"Budapest"]
[null,null,null,null,null,null,null,null,null,null,null,null,null,null,null,null,null,null,null,null,1084,"Budapest"]
[null,null,null,null,null,null,null,null,null,null,null,null,null,null,null,null,null,null,null,null,1085,"Budapest"]
[null,null,null,null,null,null,null,null,null,null,null,null,null,null,null,null,null,null,null,null,1086,"Budapest"]
[null,null,null,null,null,null,null,null,null,null,null,null,null,null,null,null,null,null,null,null,1087,"Budapest"]
[null,null,null,null,null,null,null,null,null,null,null,null,null,null,null,null,null,null,null,null,1088,"Budapest"]
[null,null,null,null,null,null,null,null,null,null,null,null,null,null,null,null,null,null,null,null,1089,"Budapest"]
[null,null,null,null,null,null,null,null,null,null,null,null,null,null,null,null,null,null,null,null,1091,"Budapest"]
[null,null,null,null,null,null,null,null,null,null,null,null,null,null,null,null,null,null,null,null,1092,"Budapest"]
[null,null,null,null,null,null,null,null,null,null,null,null,null,null,null,null,null,null,null,null,1093,"Budapest"]
[null,null,null,null,null,null,null,null,null,null,null,null,null,null,null,null,null,null,null,null,1094,"Budapest"]
[null,null,null,null,null,null,null,null,null,null,null,null,null,null,null,null,null,null,null,null,1095,"Budapest"]
[null,null,null,null,null,null,null,null,null,null,null,null,null,null,null,null,null,null,null,null,1096,"Budapest"]
[null,null,null,null,null,null,null,null,null,null,null,null,null,null,null,null,null,null,null,null,1097,"Budapest"]
[null,null,null,null,null,null,null,null,null,null,null,null,null,null,null,null,null,null,null,null,1098,"Budapest"]
[null,null,null,null,null,null,null,null,null,null,null,null,null,null,null,null,null,null,null,null,1101,"Budapest"]
[null,null,null,null,null,null,null,null,null,null,null,null,null,null,null,null,null,null,null,null,1102,"Budapest"]
[null,null,null,null,null,null,null,null,null,null,null,null,null,null,null,null,null,null,null,null,1103,"Budapest"]
[null,null,null,null,null,null,null,null,null,null,null,null,null,null,null,null,null,null,null,null,1104,"Budapest"]
[null,null,null,null,null,null,null,null,null,null,null,null,null,null,null,null,null,null,null,null,1105,"Budapest"]
[null,null,null,null,null,null,null,null,null,null,null,null,null,null,null,null,null,null,null,null,1106,"Budapest"]
[null,null,null,null,null,null,null,null,null,null,null,null,null,null,null,null,null,null,null,null,1107,"Budapest"]
[null,null,null,null,null,null,null,null,null,null,null,null,null,null,null,null,null,null,null,null,1108,"Budapest"]
[null,null,null,null,null,null,null,null,null,null,null,null,null,null,null,null,null,null,null,null,1111,"Budapest"]
[null,null,null,null,null,null,null,null,null,null,null,null,null,null,null,null,null,null,null,null,1112,"Budapest"]
[null,null,null,null,null,null,null,null,null,null,null,null,null,null,null,null,null,null,null,null,1113,"Budapest"]
[null,null,null,null,null,null,null,null,null,null,null,null,null,null,null,null,null,null,null,null,1114,"Budapest"]
[null,null,null,null,null,null,null,null,null,null,null,null,null,null,null,null,null,null,null,null,1115,"Budapest"]
[null,null,null,null,null,null,null,null,null,null,null,null,null,null,null,null,null,null,null,null,1116,"Budapest"]
[null,null,null,null,null,null,null,null,null,null,null,null,null,null,null,null,null,null,null,null,1117,"Budapest"]
[null,null,null,null,null,null,null,null,null,null,null,null,null,null,null,null,null,null,null,null,1118,"Budapest"]
[null,null,null,null,null,null,null,null,null,null,null,null,null,null,null,null,null,null,null,null,1119,"Budapest"]
[null,null,null,null,null,null,null,null,null,null,null,null,null,null,null,null,null,null,null,null,1121,"Budapest"]
[null,null,null,null,null,null,null,null,null,null,null,null,null,null,null,null,null,null,null,null,1122,"Budapest"]
[null,null,null,null,null,null,null,null,null,null,null,null,null,null,null,null,null,null,null,null,1123,"Budapest"]
[null,null,null,null,null,null,null,null,null,null,null,null,null,null,null,null,null,null,null,null,1124,"Budapest"]
[null,null,null,null,null,null,null,null,null,null,null,null,null,null,null,null,null,null,null,null,1125,"Budapest"]
[null,null,null,null,null,null,null,null,null,null,null,null,null,null,null,null,null,null,null,null,1126,"Budapest"]
[null,null,null,null,null,null,null,null,null,null,null,null,null,null,null,null,null,null,null,null,1131,"Budapest"]
[null,null,null,null,null,null,null,null,null,null,null,null,null,null,null,null,null,null,null,null,1132,"Budapest"]
[null,null,null,null,null,null,null,null,null,null,null,null,null,null,null,null,null,null,null,null,1133,"Budapest"]
[null,null,null,null,null,null,null,null,null,null,null,null,null,null,null,null,null,null,null,null,1134,"Budapest"]
[null,null,null,null,null,null,null,null,null,null,null,null,null,null,null,null,null,null,null,null,1135,"Budapest"]
[null,null,null,null,null,null,null,null,null,null,null,null,null,null,null,null,null,null,null,null,1136,"Budapest"]
[null,null,null,null,null,null,null,null,null,null,null,null,null,null,null,null,null,null,null,null,1137,"Budapest"]
[null,null,null,null,null,null,null,null,null,null,null,null,null,null,null,null,null,null,null,null,1138,"Budapest"]
[null,null,null,null,null,null,null,null,null,null,null,null,null,null,null,null,null,null,null,null,1139,"Budapest"]
[null,null,null,null,null,null,null,null,null,null,null,null,null,null,null,null,null,null,null,null,1141,"Budapest"]
[null,null,null,null,null,null,null,null,null,null,null,null,null,null,null,null,null,null,null,null,1142,"Budapest"]
[null,null,null,null,null,null,null,null,null,null,null,null,null,null,null,null,null,null,null,null,1143,"Budapest"]
[null,null,null,null,null,null,null,null,null,null,null,null,null,null,null,null,null,null,null,null,1144,"Budapest"]
[null,null,null,null,null,null,null,null,null,null,null,null,null,null,null,null,null,null,null,null,1145,"Budapest"]
[null,null,null,null,null,null,null,null,null,null,null,null,null,null,null,null,null,null,null,null,1146,"Budapest"]
[null,null,null,null,null,null,null,null,null,null,null,null,null,null,null,null,null,null,null,null,1147,"Budapest"]
[null,null,null,null,null,null,null,null,null,null,null,null,null,null,null,null,null,null,null,null,1148,"Budapest"]
[null,null,null,null,null,null,null,null,null,null,null,null,null,null,null,null,null,null,null,null,1149,"Budapest"]
[null,null,null,null,null,null,null,null,null,null,null,null,null,null,null,null,null,null,null,null,1151,"Budapest"]
[null,null,null,null,null,null,null,null,null,null,null,null,null,null,null,null,null,null,null,null,1152,"Budapest"]
[null,null,null,null,null,null,null,null,null,null,null,null,null,null,null,null,null,null,null,null,1153,"Budapest"]
[null,null,null,null,null,null,null,null,null,null,null,null,null,null,null,null,null,null,null,null,1154,"Budapest"]
[null,null,null,null,null,null,null,null,null,null,null,null,null,null,null,null,null,null,null,null,1155,"Budapest"]
[null,null,null,null,null,null,null,null,null,null,null,null,null,null,null,null,null,null,null,null,1156,"Budapest"]
[null,null,null,null,null,null,null,null,null,null,null,null,null,null,null,null,null,null,null,null,1157,"Budapest"]
[null,null,null,null,null,null,null,null,null,null,null,null,null,null,null,null,null,null,null,null,1158,"Budapest"]
[null,null,null,null,null,null,null,null,null,null,null,null,null,null,null,null,null,null,null,null,1161,"Budapest"]
[null,null,null,null,null,null,null,null,null,null,null,null,null,null,null,null,null,null,null,null,1162,"Budapest"]
[null,null,null,null,null,null,null,null,null,null,null,null,null,null,null,null,null,null,null,null,1163,"Budapest"]
[null,null,null,null,null,null,null,null,null,null,null,null,null,null,null,null,null,null,null,null,1164,"Budapest"]
[null,null,null,null,null,null,null,null,null,null,null,null,null,null,null,null,null,null,null,null,1165,"Budapest"]
[null,null,null,null,null,null,null,null,null,null,null,null,null,null,null,null,null,null,null,null,1171,"Budapest"]
[null,null,null,null,null,null,null,null,null,null,null,null,null,null,null,null,null,null,null,null,1172,"Budapest"]
[null,null,null,null,null,null,null,null,null,null,null,null,null,null,null,null,null,null,null,null,1173,"Budapest"]
[null,null,null,null,null,null,null,null,null,null,null,null,null,null,null,null,null,null,null,null,1174,"Budapest"]
[null,null,null,null,null,null,null,null,null,null,null,null,null,null,null,null,null,null,null,null,1181,"Budapest"]
[null,null,null,null,null,null,null,null,null,null,null,null,null,null,null,null,null,null,null,null,1182,"Budapest"]
[null,null,null,null,null,null,null,null,null,null,null,null,null,null,null,null,null,null,null,null,1183,"Budapest"]
[null,null,null,null,null,null,null,null,null,null,null,null,null,null,null,null,null,null,null,null,1184,"Budapest"]
[null,null,null,null,null,null,null,null,null,null,null,null,null,null,null,null,null,null,null,null,1185,"Budapest"]
[null,null,null,null,null,null,null,null,null,null,null,null,null,null,null,null,null,null,null,null,1186,"Budapest"]
[null,null,null,null,null,null,null,null,null,null,null,null,null,null,null,null,null,null,null,null,1188,"Budapest"]
[null,null,null,null,null,null,null,null,null,null,null,null,null,null,null,null,null,null,null,null,1191,"Budapest"]
[null,null,null,null,null,null,null,null,null,null,null,null,null,null,null,null,null,null,null,null,1192,"Budapest"]
[null,null,null,null,null,null,null,null,null,null,null,null,null,null,null,null,null,null,null,null,1193,"Budapest"]
[null,null,null,null,null,null,null,null,null,null,null,null,null,null,null,null,null,null,null,null,1194,"Budapest"]
[null,null,null,null,null,null,null,null,null,null,null,null,null,null,null,null,null,null,null,null,1195,"Budapest"]
[null,null,null,null,null,null,null,null,null,null,null,null,null,null,null,null,null,null,null,null,1196,"Budapest"]
[null,null,null,null,null,null,null,null,null,null,null,null,null,null,null,null,null,null,null,null,1201,"Budapest"]
[null,null,null,null,null,null,null,null,null,null,null,null,null,null,null,null,null,null,null,null,1202,"Budapest"]
[null,null,null,null,null,null,null,null,null,null,null,null,null,null,null,null,null,null,null,null,1203,"Budapest"]
[null,null,null,null,null,null,null,null,null,null,null,null,null,null,null,null,null,null,null,null,1204,"Budapest"]
[null,null,null,null,null,null,null,null,null,null,null,null,null,null,null,null,null,null,null,null,1205,"Budapest"]
[null,null,null,null,null,null,null,null,null,null,null,null,null,null,null,null,null,null,null,null,1211,"Budapest"]
[null,null,null,null,null,null,null,null,null,null,null,null,null,null,null,null,null,null,null,null,1212,"Budapest"]
[null,null,null,null,null,null,null,null,null,null,null,null,null,null,null,null,null,null,null,null,1213,"Budapest"]
[null,null,null,null,null,null,null,null,null,null,null,null,null,null,null,null,null,null,null,null,1214,"Budapest"]
[null,null,null,null,null,null,null,null,null,null,null,null,null,null,null,null,null,null,null,null,1215,"Budapest"]
[null,null,null,null,null,null,null,null,null,null,null,null,null,null,null,null,null,null,null,null,1221,"Budapest"]
[null,null,null,null,null,null,null,null,null,null,null,null,null,null,null,null,null,null,null,null,1222,"Budapest"]
[null,null,null,null,null,null,null,null,null,null,null,null,null,null,null,null,null,null,null,null,1223,"Budapest"]
[null,null,null,null,null,null,null,null,null,null,null,null,null,null,null,null,null,null,null,null,1224,"Budapest"]
[null,null,null,null,null,null,null,null,null,null,null,null,null,null,null,null,null,null,null,null,1225,"Budapest"]
[null,null,null,null,null,null,null,null,null,null,null,null,null,null,null,null,null,null,null,null,1237,"Budapest"]
[null,null,null,null,null,null,null,null,null,null,null,null,null,null,null,null,null,null,null,null,1238,"Budapest"]
[null,null,null,null,null,null,null,null,null,null,null,null,null,null,null,null,null,null,null,null,1239,"Budapest"]
[null,null,null,null,null,null,null,null,null,null,null,null,null,null,null,null,null,null,null,null,1529,"Budapest"]
[null,null,null,null,null,null,null,null,null,null,null,null,null,null,null,null,null,null,null,null,6114,"Bugac","Bács-Kiskun"]
[null,null,null,null,null,null,null,null,null,null,null,null,null,null,null,null,null,null,null,null,6114,"Bugacpusztaháza","Bács-Kiskun"]
[null,null,null,null,null,null,null,null,null,null,null,null,null,null,null,null,null,null,null,null,2347,"Bugyi","Pest"]
[null,null,null,null,null,null,null,null,null,null,null,null,null,null,null,null,null,null,null,null,4483,"Buj","Szabolcs-Szatmár-Bereg"]
[null,null,null,null,null,null,null,null,null,null,null,null,null,null,null,null,null,null,null,null,3047,"Buják","Nógrád"]
[null,null,null,null,null,null,null,null,null,null,null,null,null,null,null,null,null,null,null,null,9740,"Bük","Somogy"]
[null,null,null,null,null,null,null,null,null,null,null,null,null,null,null,null,null,null,null,null,9737,"Bük","Vas"]
[null,null,null,null,null,null,null,null,null,null,null,null,null,null,null,null,null,null,null,null,3422,"Bükkábrány","Vas"]
[null,null,null,null,null,null,null,null,null,null,null,null,null,null,null,null,null,null,null,null,3554,"Bükkaranyos","Borsod-Abaúj-Zemplén"]
[null,null,null,null,null,null,null,null,null,null,null,null,null,null,null,null,null,null,null,null,3648,"Bükkmogyorósd","Borsod-Abaúj-Zemplén"]
[null,null,null,null,null,null,null,null,null,null,null,null,null,null,null,null,null,null,null,null,7682,"Bükkösd","Borsod-Abaúj-Zemplén"]
[null,null,null,null,null,null,null,null,null,null,null,null,null,null,null,null,null,null,null,null,3335,"Bükkszék","Baranya"]
[null,null,null,null,null,null,null,null,null,null,null,null,null,null,null,null,null,null,null,null,3257,"Bükkszenterzsébet","Heves"]
[null,null,null,null,null,null,null,null,null,null,null,null,null,null,null,null,null,null,null,null,3557,"Bükkszentkereszt","Heves"]
[null,null,null,null,null,null,null,null,null,null,null,null,null,null,null,null,null,null,null,null,3346,"Bükkszentmárton","Borsod-Abaúj-Zemplén"]
[null,null,null,null,null,null,null,null,null,null,null,null,null,null,null,null,null,null,null,null,3414,"Bükkzsérc","Heves"]
[null,null,null,null,null,null,null,null,null,null,null,null,null,null,null,null,null,null,null,null,7973,"Bürüs","Borsod-Abaúj-Zemplén"]
[null,null,null,null,null,null,null,null,null,null,null,null,null,null,null,null,null,null,null,null,7273,"Büssü","Baranya"]
[null,null,null,null,null,null,null,null,null,null,null,null,null,null,null,null,null,null,null,null,3821,"Büttös","Somogy"]
[null,null,null,null,null,null,null,null,null,null,null,null,null,null,null,null,null,null,null,null,8695,"Buzsák","Borsod-Abaúj-Zemplén"]
[null,null,null,null,null,null,null,null,null,null,null,null,null,null,null,null,null,null,null,null,9725,"Cák","Vas"]
[null,null,null,null,null,null,null,null,null,null,null,null,null,null,null,null,null,null,null,null,9165,"Cakóháza","Győr-Moson-Sopron"]
[null,null,null,null,null,null,null,null,null,null,null,null,null,null,null,null,null,null,null,null,7013,"Cece","Fejér"]
[null,null,null,null,null,null,null,null,null,null,null,null,null,null,null,null,null,null,null,null,4732,"Cégénydányád","Szabolcs-Szatmár-Bereg"]
[null,null,null,null,null,null,null,null,null,null,null,null,null,null,null,null,null,null,null,null,2738,"Cegléd","Pest"]
[null,null,null,null,null,null,null,null,null,null,null,null,null,null,null,null,null,null,null,null,2700,"Cegléd","Pest"]
[null,null,null,null,null,null,null,null,null,null,null,null,null,null,null,null,null,null,null,null,2737,"Ceglédbercel","Pest"]
[null,null,null,null,null,null,null,null,null,null,null,null,null,null,null,null,null,null,null,null,9541,"Celldömölk","Vas"]
[null,null,null,null,null,null,null,null,null,null,null,null,null,null,null,null,null,null,null,null,9500,"Celldömölk","Vas"]
[null,null,null,null,null,null,null,null,null,null,null,null,null,null,null,null,null,null,null,null,3123,"Cered","Nógrád"]
[null,null,null,null,null,null,null,null,null,null,null,null,null,null,null,null,null,null,null,null,9624,"Chernelházadamonya","Vas"]
[null,null,null,null,null,null,null,null,null,null,null,null,null,null,null,null,null,null,null,null,5462,"Cibakháza","Jász-Nagykun-Szolnok"]
[null,null,null,null,null,null,null,null,null,null,null,null,null,null,null,null,null,null,null,null,3973,"Cigánd","Borsod-Abaúj-Zemplén"]
[null,null,null,null,null,null,null,null,null,null,null,null,null,null,null,null,null,null,null,null,7161,"Cikó","Tolna"]
[null,null,null,null,null,null,null,null,null,null,null,null,null,null,null,null,null,null,null,null,9364,"Cirák","Győr-Moson-Sopron"]
[null,null,null,null,null,null,null,null,null,null,null,null,null,null,null,null,null,null,null,null,5551,"Csabacsűd","Békés"]
[null,null,null,null,null,null,null,null,null,null,null,null,null,null,null,null,null,null,null,null,5609,"Csabaszabadi","Békés"]
[null,null,null,null,null,null,null,null,null,null,null,null,null,null,null,null,null,null,null,null,2064,"Csabdi","Fejér"]
[null,null,null,null,null,null,null,null,null,null,null,null,null,null,null,null,null,null,null,null,8474,"Csabrendek","Veszprém"]
[null,null,null,null,null,null,null,null,null,null,null,null,null,null,null,null,null,null,null,null,9375,"Csáfordjánosfa","Győr-Moson-Sopron"]
[null,null,null,null,null,null,null,null,null,null,null,null,null,null,null,null,null,null,null,null,4967,"Csaholc","Szabolcs-Szatmár-Bereg"]
[null,null,null,null,null,null,null,null,null,null,null,null,null,null,null,null,null,null,null,null,8163,"Csajág","Veszprém"]
[null,null,null,null,null,null,null,null,null,null,null,null,null,null,null,null,null,null,null,null,8735,"Csákány","Somogy"]
[null,null,null,null,null,null,null,null,null,null,null,null,null,null,null,null,null,null,null,null,9919,"Csákánydoroszló","Vas"]
[null,null,null,null,null,null,null,null,null,null,null,null,null,null,null,null,null,null,null,null,8073,"Csákberény","Fejér"]
[null,null,null,null,null,null,null,null,null,null,null,null,null,null,null,null,null,null,null,null,8083,"Csákvár","Fejér"]
[null,null,null,null,null,null,null,null,null,null,null,null,null,null,null,null,null,null,null,null,6915,"Csanádalberti","Csongrád"]
[null,null,null,null,null,null,null,null,null,null,null,null,null,null,null,null,null,null,null,null,5662,"Csanádapáca","Békés"]
[null,null,null,null,null,null,null,null,null,null,null,null,null,null,null,null,null,null,null,null,6913,"Csanádpalota","Csongrád"]
[null,null,null,null,null,null,null,null,null,null,null,null,null,null,null,null,null,null,null,null,9654,"Csánig","Vas"]
[null,null,null,null,null,null,null,null,null,null,null,null,null,null,null,null,null,null,null,null,3015,"Csány","Heves"]
[null,null,null,null,null,null,null,null,null,null,null,null,null,null,null,null,null,null,null,null,7964,"Csányoszró","Baranya"]
[null,null,null,null,null,null,null,null,null,null,null,null,null,null,null,null,null,null,null,null,6647,"Csanytelek","Csongrád"]
[null,null,null,null,null,null,null,null,null,null,null,null,null,null,null,null,null,null,null,null,8756,"Csapi","Zala"]
[null,null,null,null,null,null,null,null,null,null,null,null,null,null,null,null,null,null,null,null,9372,"Csapod","Győr-Moson-Sopron"]
[null,null,null,null,null,null,null,null,null,null,null,null,null,null,null,null,null,null,null,null,5621,"Csárdaszállás","Békés"]
[null,null,null,null,null,null,null,null,null,null,null,null,null,null,null,null,null,null,null,null,7811,"Csarnóta","Baranya"]
[null,null,null,null,null,null,null,null,null,null,null,null,null,null,null,null,null,null,null,null,4844,"Csaroda","Szabolcs-Szatmár-Bereg"]
[null,null,null,null,null,null,null,null,null,null,null,null,null,null,null,null,null,null,null,null,2858,"Császár","Komárom-Esztergom"]
[null,null,null,null,null,null,null,null,null,null,null,null,null,null,null,null,null,null,null,null,6239,"Császártöltés","Bács-Kiskun"]
[null,null,null,null,null,null,null,null,null,null,null,null,null,null,null,null,null,null,null,null,4973,"Császló","Szabolcs-Szatmár-Bereg"]
[null,null,null,null,null,null,null,null,null,null,null,null,null,null,null,null,null,null,null,null,6523,"Csátalja","Bács-Kiskun"]
[null,null,null,null,null,null,null,null,null,null,null,null,null,null,null,null,null,null,null,null,8943,"Csatár","Zala"]
[null,null,null,null,null,null,null,null,null,null,null,null,null,null,null,null,null,null,null,null,5064,"Csataszög","Jász-Nagykun-Szolnok"]
[null,null,null,null,null,null,null,null,null,null,null,null,null,null,null,null,null,null,null,null,2888,"Csatka","Komárom-Esztergom"]
[null,null,null,null,null,null,null,null,null,null,null,null,null,null,null,null,null,null,null,null,6448,"Csávoly","Bács-Kiskun"]
[null,null,null,null,null,null,null,null,null,null,null,null,null,null,null,null,null,null,null,null,7935,"Csebény","Baranya"]
[null,null,null,null,null,null,null,null,null,null,null,null,null,null,null,null,null,null,null,null,3052,"Csécse","Nógrád"]
[null,null,null,null,null,null,null,null,null,null,null,null,null,null,null,null,null,null,null,null,4742,"Csegöld","Szabolcs-Szatmár-Bereg"]
[null,null,null,null,null,null,null,null,null,null,null,null,null,null,null,null,null,null,null,null,8445,"Csehbánya","Veszprém"]
[null,null,null,null,null,null,null,null,null,null,null,null,null,null,null,null,null,null,null,null,9833,"Csehi","Vas"]
[null,null,null,null,null,null,null,null,null,null,null,null,null,null,null,null,null,null,null,null,9834,"Csehimindszent","Vas"]
[null,null,null,null,null,null,null,null,null,null,null,null,null,null,null,null,null,null,null,null,2949,"Csém","Komárom-Esztergom"]
[null,null,null,null,null,null,null,null,null,null,null,null,null,null,null,null,null,null,null,null,2713,"Csemő","Pest"]
[null,null,null,null,null,null,null,null,null,null,null,null,null,null,null,null,null,null,null,null,9764,"Csempeszkopács","Vas"]
[null,null,null,null,null,null,null,null,null,null,null,null,null,null,null,null,null,null,null,null,6765,"Csengele","Csongrád"]
[null,null,null,null,null,null,null,null,null,null,null,null,null,null,null,null,null,null,null,null,4765,"Csenger","Szabolcs-Szatmár-Bereg"]
[null,null,null,null,null,null,null,null,null,null,null,null,null,null,null,null,null,null,null,null,4743,"Csengersima","Szabolcs-Szatmár-Bereg"]
[null,null,null,null,null,null,null,null,null,null,null,null,null,null,null,null,null,null,null,null,4764,"Csengerújfalu","Szabolcs-Szatmár-Bereg"]
[null,null,null,null,null,null,null,null,null,null,null,null,null,null,null,null,null,null,null,null,6222,"Csengőd","Bács-Kiskun"]
[null,null,null,null,null,null,null,null,null,null,null,null,null,null,null,null,null,null,null,null,9611,"Csénye","Vas"]
[null,null,null,null,null,null,null,null,null,null,null,null,null,null,null,null,null,null,null,null,3837,"Csenyéte","Borsod-Abaúj-Zemplén"]
[null,null,null,null,null,null,null,null,null,null,null,null,null,null,null,null,null,null,null,null,2946,"Csép","Komárom-Esztergom"]
[null,null,null,null,null,null,null,null,null,null,null,null,null,null,null,null,null,null,null,null,5475,"Csépa","Jász-Nagykun-Szolnok"]
[null,null,null,null,null,null,null,null,null,null,null,null,null,null,null,null,null,null,null,null,9735,"Csepreg","Vas"]
[null,null,null,null,null,null,null,null,null,null,null,null,null,null,null,null,null,null,null,null,9375,"Csér","Győr-Moson-Sopron"]
[null,null,null,null,null,null,null,null,null,null,null,null,null,null,null,null,null,null,null,null,7683,"Cserdi","Baranya"]
[null,null,null,null,null,null,null,null,null,null,null,null,null,null,null,null,null,null,null,null,7472,"Cserénfa","Somogy"]
[null,null,null,null,null,null,null,null,null,null,null,null,null,null,null,null,null,null,null,null,3413,"Cserépfalu","Borsod-Abaúj-Zemplén"]
[null,null,null,null,null,null,null,null,null,null,null,null,null,null,null,null,null,null,null,null,3417,"Cserépváralja","Borsod-Abaúj-Zemplén"]
[null,null,null,null,null,null,null,null,null,null,null,null,null,null,null,null,null,null,null,null,2694,"Cserháthaláp","Nógrád"]
[null,null,null,null,null,null,null,null,null,null,null,null,null,null,null,null,null,null,null,null,2676,"Cserhátsurány","Nógrád"]
[null,null,null,null,null,null,null,null,null,null,null,null,null,null,null,null,null,null,null,null,3066,"Cserhátszentiván","Nógrád"]
[null,null,null,null,null,null,null,null,null,null,null,null,null,null,null,null,null,null,null,null,5465,"Cserkeszőlő","Jász-Nagykun-Szolnok"]
[null,null,null,null,null,null,null,null,null,null,null,null,null,null,null,null,null,null,null,null,7673,"Cserkút","Baranya"]
[null,null,null,null,null,null,null,null,null,null,null,null,null,null,null,null,null,null,null,null,3648,"Csernely","Borsod-Abaúj-Zemplén"]
[null,null,null,null,null,null,null,null,null,null,null,null,null,null,null,null,null,null,null,null,8372,"Cserszegtomaj","Zala"]
[null,null,null,null,null,null,null,null,null,null,null,null,null,null,null,null,null,null,null,null,8951,"Csertalakos","Zala"]
[null,null,null,null,null,null,null,null,null,null,null,null,null,null,null,null,null,null,null,null,7900,"Csertő","Baranya"]
[null,null,null,null,null,null,null,null,null,null,null,null,null,null,null,null,null,null,null,null,8419,"Csesznek","Veszprém"]
[null,null,null,null,null,null,null,null,null,null,null,null,null,null,null,null,null,null,null,null,8973,"Csesztreg","Zala"]
[null,null,null,null,null,null,null,null,null,null,null,null,null,null,null,null,null,null,null,null,2678,"Csesztve","Nógrád"]
[null,null,null,null,null,null,null,null,null,null,null,null,null,null,null,null,null,null,null,null,8417,"Csetény","Veszprém"]
[null,null,null,null,null,null,null,null,null,null,null,null,null,null,null,null,null,null,null,null,2212,"Csévharaszt","Pest"]
[null,null,null,null,null,null,null,null,null,null,null,null,null,null,null,null,null,null,null,null,7225,"Csibrák","Tolna"]
[null,null,null,null,null,null,null,null,null,null,null,null,null,null,null,null,null,null,null,null,6424,"Csikéria","Bács-Kiskun"]
[null,null,null,null,null,null,null,null,null,null,null,null,null,null,null,null,null,null,null,null,7341,"Csikóstőttős","Tolna"]
[null,null,null,null,null,null,null,null,null,null,null,null,null,null,null,null,null,null,null,null,9127,"Csikvánd","Győr-Moson-Sopron"]
[null,null,null,null,null,null,null,null,null,null,null,null,null,null,null,null,null,null,null,null,3442,"Csincse","Borsod-Abaúj-Zemplén"]
[null,null,null,null,null,null,null,null,null,null,null,null,null,null,null,null,null,null,null,null,9836,"Csipkerek","Vas"]
[null,null,null,null,null,null,null,null,null,null,null,null,null,null,null,null,null,null,null,null,2673,"Csitár","Nógrád"]
[null,null,null,null,null,null,null,null,null,null,null,null,null,null,null,null,null,null,null,null,3848,"Csobád","Borsod-Abaúj-Zemplén"]
[null,null,null,null,null,null,null,null,null,null,null,null,null,null,null,null,null,null,null,null,3927,"Csobaj","Borsod-Abaúj-Zemplén"]
[null,null,null,null,null,null,null,null,null,null,null,null,null,null,null,null,null,null,null,null,2014,"Csobánka","Pest"]
[null,null,null,null,null,null,null,null,null,null,null,null,null,null,null,null,null,null,null,null,8999,"Csöde","Fejér"]
[null,null,null,null,null,null,null,null,null,null,null,null,null,null,null,null,null,null,null,null,8495,"Csögle","Somogy"]
[null,null,null,null,null,null,null,null,null,null,null,null,null,null,null,null,null,null,null,null,8074,"Csókakő","Borsod-Abaúj-Zemplén"]
[null,null,null,null,null,null,null,null,null,null,null,null,null,null,null,null,null,null,null,null,4145,"Csökmő","Komárom-Esztergom"]
[null,null,null,null,null,null,null,null,null,null,null,null,null,null,null,null,null,null,null,null,7526,"Csököly","Bács-Kiskun"]
[null,null,null,null,null,null,null,null,null,null,null,null,null,null,null,null,null,null,null,null,7555,"Csokonyavisonta","Somogy"]
[null,null,null,null,null,null,null,null,null,null,null,null,null,null,null,null,null,null,null,null,3647,"Csokvaomány","Pest"]
[null,null,null,null,null,null,null,null,null,null,null,null,null,null,null,null,null,null,null,null,2521,"Csolnok","Somogy"]
[null,null,null,null,null,null,null,null,null,null,null,null,null,null,null,null,null,null,null,null,6135,"Csólyospálos","Csongrád"]
[null,null,null,null,null,null,null,null,null,null,null,null,null,null,null,null,null,null,null,null,7253,"Csoma","Csongrád"]
[null,null,null,null,null,null,null,null,null,null,null,null,null,null,null,null,null,null,null,null,2161,"Csomád","Zala"]
[null,null,null,null,null,null,null,null,null,null,null,null,null,null,null,null,null,null,null,null,7432,"Csombárd","Baranya"]
[null,null,null,null,null,null,null,null,null,null,null,null,null,null,null,null,null,null,null,null,8700,"Csömend","Veszprém"]
[null,null,null,null,null,null,null,null,null,null,null,null,null,null,null,null,null,null,null,null,8957,"Csömödér","Fejér"]
[null,null,null,null,null,null,null,null,null,null,null,null,null,null,null,null,null,null,null,null,2141,"Csömör","Győr-Moson-Sopron"]
[null,null,null,null,null,null,null,null,null,null,null,null,null,null,null,null,null,null,null,null,9513,"Csönge","Békés"]
[null,null,null,null,null,null,null,null,null,null,null,null,null,null,null,null,null,null,null,null,6648,"Csongrád","Veszprém"]
[null,null,null,null,null,null,null,null,null,null,null,null,null,null,null,null,null,null,null,null,6640,"Csongrád","Zala"]
[null,null,null,null,null,null,null,null,null,null,null,null,null,null,null,null,null,null,null,null,8918,"Csonkahegyhát","Veszprém"]
[null,null,null,null,null,null,null,null,null,null,null,null,null,null,null,null,null,null,null,null,7940,"Csonkamindszent","Hajdú-Bihar"]
[null,null,null,null,null,null,null,null,null,null,null,null,null,null,null,null,null,null,null,null,8229,"Csopak","Somogy"]
[null,null,null,null,null,null,null,null,null,null,null,null,null,null,null,null,null,null,null,null,8041,"Csór","Somogy"]
[null,null,null,null,null,null,null,null,null,null,null,null,null,null,null,null,null,null,null,null,9300,"Csorna","Zala"]
[null,null,null,null,null,null,null,null,null,null,null,null,null,null,null,null,null,null,null,null,8873,"Csörnyeföld","Pest"]
[null,null,null,null,null,null,null,null,null,null,null,null,null,null,null,null,null,null,null,null,9962,"Csörötnek","Vas"]
[null,null,null,null,null,null,null,null,null,null,null,null,null,null,null,null,null,null,null,null,5920,"Csorvás","Zala"]
[null,null,null,null,null,null,null,null,null,null,null,null,null,null,null,null,null,null,null,null,8122,"Csősz","Vas"]
[null,null,null,null,null,null,null,null,null,null,null,null,null,null,null,null,null,null,null,null,8558,"Csót","Fejér"]
[null,null,null,null,null,null,null,null,null,null,null,null,null,null,null,null,null,null,null,null,2615,"Csővár","Pest"]
[null,null,null,null,null,null,null,null,null,null,null,null,null,null,null,null,null,null,null,null,8840,"Csurgó","Somogy"]
[null,null,null,null,null,null,null,null,null,null,null,null,null,null,null,null,null,null,null,null,8840,"Csurgónagymarton","Somogy"]
[null,null,null,null,null,null,null,null,null,null,null,null,null,null,null,null,null,null,null,null,7843,"Cún","Baranya"]
[null,null,null,null,null,null,null,null,null,null,null,null,null,null,null,null,null,null,null,null,2373,"Dabas","Pest"]
[null,null,null,null,null,null,null,null,null,null,null,null,null,null,null,null,null,null,null,null,2371,"Dabas","Pest"]
[null,null,null,null,null,null,null,null,null,null,null,null,null,null,null,null,null,null,null,null,2370,"Dabas","Pest"]
[null,null,null,null,null,null,null,null,null,null,null,null,null,null,null,null,null,null,null,null,8345,"Dabronc","Veszprém"]
[null,null,null,null,null,null,null,null,null,null,null,null,null,null,null,null,null,null,null,null,8485,"Dabrony","Veszprém"]
[null,null,null,null,null,null,null,null,null,null,null,null,null,null,null,null,null,null,null,null,2854,"Dad","Komárom-Esztergom"]
[null,null,null,null,null,null,null,null,null,null,null,null,null,null,null,null,null,null,null,null,2522,"Dág","Komárom-Esztergom"]
[null,null,null,null,null,null,null,null,null,null,null,null,null,null,null,null,null,null,null,null,8592,"Dáka","Veszprém"]
[null,null,null,null,null,null,null,null,null,null,null,null,null,null,null,null,null,null,null,null,7211,"Dalmand","Tolna"]
[null,null,null,null,null,null,null,null,null,null,null,null,null,null,null,null,null,null,null,null,3780,"Damak","Borsod-Abaúj-Zemplén"]
[null,null,null,null,null,null,null,null,null,null,null,null,null,null,null,null,null,null,null,null,3978,"Dámóc","Borsod-Abaúj-Zemplén"]
[null,null,null,null,null,null,null,null,null,null,null,null,null,null,null,null,null,null,null,null,2735,"Dánszentmiklós","Pest"]
[null,null,null,null,null,null,null,null,null,null,null,null,null,null,null,null,null,null,null,null,2118,"Dány","Pest"]
[null,null,null,null,null,null,null,null,null,null,null,null,null,null,null,null,null,null,null,null,9917,"Daraboshegy","Vas"]
[null,null,null,null,null,null,null,null,null,null,null,null,null,null,null,null,null,null,null,null,7988,"Darány","Somogy"]
[null,null,null,null,null,null,null,null,null,null,null,null,null,null,null,null,null,null,null,null,4737,"Darnó","Szabolcs-Szatmár-Bereg"]
[null,null,null,null,null,null,null,null,null,null,null,null,null,null,null,null,null,null,null,null,9232,"Darnózseli","Győr-Moson-Sopron"]
[null,null,null,null,null,null,null,null,null,null,null,null,null,null,null,null,null,null,null,null,4144,"Darvas","Hajdú-Bihar"]
[null,null,null,null,null,null,null,null,null,null,null,null,null,null,null,null,null,null,null,null,6524,"Dávod","Bács-Kiskun"]
[null,null,null,null,null,null,null,null,null,null,null,null,null,null,null,null,null,null,null,null,2694,"Debercsény","Nógrád"]
[null,null,null,null,null,null,null,null,null,null,null,null,null,null,null,null,null,null,null,null,4079,"Debrecen","Hajdú-Bihar"]
[null,null,null,null,null,null,null,null,null,null,null,null,null,null,null,null,null,null,null,null,4078,"Debrecen","Hajdú-Bihar"]
[null,null,null,null,null,null,null,null,null,null,null,null,null,null,null,null,null,null,null,null,4225,"Debrecen","Hajdú-Bihar"]
[null,null,null,null,null,null,null,null,null,null,null,null,null,null,null,null,null,null,null,null,4063,"Debrecen","Hajdú-Bihar"]
[null,null,null,null,null,null,null,null,null,null,null,null,null,null,null,null,null,null,null,null,4000,"Debrecen","Hajdú-Bihar"]
[null,null,null,null,null,null,null,null,null,null,null,null,null,null,null,null,null,null,null,null,4002,"Debrecen","Hajdú-Bihar"]
[null,null,null,null,null,null,null,null,null,null,null,null,null,null,null,null,null,null,null,null,4024,"Debrecen","Hajdú-Bihar"]
[null,null,null,null,null,null,null,null,null,null,null,null,null,null,null,null,null,null,null,null,4025,"Debrecen","Hajdú-Bihar"]
[null,null,null,null,null,null,null,null,null,null,null,null,null,null,null,null,null,null,null,null,4026,"Debrecen","Hajdú-Bihar"]
[null,null,null,null,null,null,null,null,null,null,null,null,null,null,null,null,null,null,null,null,4027,"Debrecen","Hajdú-Bihar"]
[null,null,null,null,null,null,null,null,null,null,null,null,null,null,null,null,null,null,null,null,4028,"Debrecen","Hajdú-Bihar"]
[null,null,null,null,null,null,null,null,null,null,null,null,null,null,null,null,null,null,null,null,4029,"Debrecen","Hajdú-Bihar"]
[null,null,null,null,null,null,null,null,null,null,null,null,null,null,null,null,null,null,null,null,4030,"Debrecen","Hajdú-Bihar"]
[null,null,null,null,null,null,null,null,null,null,null,null,null,null,null,null,null,null,null,null,4031,"Debrecen","Hajdú-Bihar"]
[null,null,null,null,null,null,null,null,null,null,null,null,null,null,null,null,null,null,null,null,4032,"Debrecen","Hajdú-Bihar"]
[null,null,null,null,null,null,null,null,null,null,null,null,null,null,null,null,null,null,null,null,4033,"Debrecen","Hajdú-Bihar"]
[null,null,null,null,null,null,null,null,null,null,null,null,null,null,null,null,null,null,null,null,4034,"Debrecen","Hajdú-Bihar"]
[null,null,null,null,null,null,null,null,null,null,null,null,null,null,null,null,null,null,null,null,3825,"Debréte","Borsod-Abaúj-Zemplén"]
[null,null,null,null,null,null,null,null,null,null,null,null,null,null,null,null,null,null,null,null,7144,"Decs","Tolna"]
[null,null,null,null,null,null,null,null,null,null,null,null,null,null,null,null,null,null,null,null,3643,"Dédestapolcsány","Borsod-Abaúj-Zemplén"]
[null,null,null,null,null,null,null,null,null,null,null,null,null,null,null,null,null,null,null,null,8135,"Dég","Fejér"]
[null,null,null,null,null,null,null,null,null,null,null,null,null,null,null,null,null,null,null,null,2649,"Dejtár","Nógrád"]
[null,null,null,null,null,null,null,null,null,null,null,null,null,null,null,null,null,null,null,null,2337,"Délegyháza","Pest"]
[null,null,null,null,null,null,null,null,null,null,null,null,null,null,null,null,null,null,null,null,4516,"Demecser","Szabolcs-Szatmár-Bereg"]
[null,null,null,null,null,null,null,null,null,null,null,null,null,null,null,null,null,null,null,null,3395,"Demjén","Heves"]
[null,null,null,null,null,null,null,null,null,null,null,null,null,null,null,null,null,null,null,null,7915,"Dencsháza","Baranya"]
[null,null,null,null,null,null,null,null,null,null,null,null,null,null,null,null,null,null,null,null,9365,"Dénesfa","Győr-Moson-Sopron"]
[null,null,null,null,null,null,null,null,null,null,null,null,null,null,null,null,null,null,null,null,4130,"Derecske","Hajdú-Bihar"]
[null,null,null,null,null,null,null,null,null,null,null,null,null,null,null,null,null,null,null,null,6621,"Derekegyház","Csongrád"]
[null,null,null,null,null,null,null,null,null,null,null,null,null,null,null,null,null,null,null,null,6772,"Deszk","Csongrád"]
[null,null,null,null,null,null,null,null,null,null,null,null,null,null,null,null,null,null,null,null,3834,"Detek","Borsod-Abaúj-Zemplén"]
[null,null,null,null,null,null,null,null,null,null,null,null,null,null,null,null,null,null,null,null,3275,"Detk","Heves"]
[null,null,null,null,null,null,null,null,null,null,null,null,null,null,null,null,null,null,null,null,5510,"Dévaványa","Békés"]
[null,null,null,null,null,null,null,null,null,null,null,null,null,null,null,null,null,null,null,null,8460,"Devecser","Veszprém"]
[null,null,null,null,null,null,null,null,null,null,null,null,null,null,null,null,null,null,null,null,7683,"Dinnyeberki","Baranya"]
[null,null,null,null,null,null,null,null,null,null,null,null,null,null,null,null,null,null,null,null,7072,"Diósberény","Tolna"]
[null,null,null,null,null,null,null,null,null,null,null,null,null,null,null,null,null,null,null,null,2049,"Diósd","Pest"]
[null,null,null,null,null,null,null,null,null,null,null,null,null,null,null,null,null,null,null,null,2643,"Diósjenő","Nógrád"]
[null,null,null,null,null,null,null,null,null,null,null,null,null,null,null,null,null,null,null,null,8764,"Dióskál","Zala"]
[null,null,null,null,null,null,null,null,null,null,null,null,null,null,null,null,null,null,null,null,7817,"Diósviszló","Baranya"]
[null,null,null,null,null,null,null,null,null,null,null,null,null,null,null,null,null,null,null,null,8482,"Doba","Veszprém"]
[null,null,null,null,null,null,null,null,null,null,null,null,null,null,null,null,null,null,null,null,9914,"Döbörhegy","Békés"]
[null,null,null,null,null,null,null,null,null,null,null,null,null,null,null,null,null,null,null,null,5624,"Doboz","Zala"]
[null,null,null,null,null,null,null,null,null,null,null,null,null,null,null,null,null,null,null,null,8874,"Dobri","Zala"]
[null,null,null,null,null,null,null,null,null,null,null,null,null,null,null,null,null,null,null,null,8357,"Döbröce","Csongrád"]
[null,null,null,null,null,null,null,null,null,null,null,null,null,null,null,null,null,null,null,null,7228,"Döbrököz","Borsod-Abaúj-Zemplén"]
[null,null,null,null,null,null,null,null,null,null,null,null,null,null,null,null,null,null,null,null,8989,"Dobronhegy","Csongrád"]
[null,null,null,null,null,null,null,null,null,null,null,null,null,null,null,null,null,null,null,null,8597,"Döbrönte","Békés"]
[null,null,null,null,null,null,null,null,null,null,null,null,null,null,null,null,null,null,null,null,6766,"Dóc","Békés"]
[null,null,null,null,null,null,null,null,null,null,null,null,null,null,null,null,null,null,null,null,4495,"Döge","Tolna"]
[null,null,null,null,null,null,null,null,null,null,null,null,null,null,null,null,null,null,null,null,3627,"Domaháza","Szabolcs-Szatmár-Bereg"]
[null,null,null,null,null,null,null,null,null,null,null,null,null,null,null,null,null,null,null,null,6781,"Domaszék","Pest"]
[null,null,null,null,null,null,null,null,null,null,null,null,null,null,null,null,null,null,null,null,5836,"Dombegyház","Heves"]
[null,null,null,null,null,null,null,null,null,null,null,null,null,null,null,null,null,null,null,null,5745,"Dombiratos","Heves"]
[null,null,null,null,null,null,null,null,null,null,null,null,null,null,null,null,null,null,null,null,7200,"Dombóvár","Komárom-Esztergom"]
[null,null,null,null,null,null,null,null,null,null,null,null,null,null,null,null,null,null,null,null,4492,"Dombrád","Nógrád"]
[null,null,null,null,null,null,null,null,null,null,null,null,null,null,null,null,null,null,null,null,2182,"Domony","Vas"]
[null,null,null,null,null,null,null,null,null,null,null,null,null,null,null,null,null,null,null,null,2027,"Dömös","Vas"]
[null,null,null,null,null,null,null,null,null,null,null,null,null,null,null,null,null,null,null,null,3263,"Domoszló","Zala"]
[null,null,null,null,null,null,null,null,null,null,null,null,null,null,null,null,null,null,null,null,2344,"Dömsöd","Tolna"]
[null,null,null,null,null,null,null,null,null,null,null,null,null,null,null,null,null,null,null,null,9147,"Dör","Veszprém"]
[null,null,null,null,null,null,null,null,null,null,null,null,null,null,null,null,null,null,null,null,8244,"Dörgicse","Szabolcs-Szatmár-Bereg"]
[null,null,null,null,null,null,null,null,null,null,null,null,null,null,null,null,null,null,null,null,3374,"Dormánd","Komárom-Esztergom"]
[null,null,null,null,null,null,null,null,null,null,null,null,null,null,null,null,null,null,null,null,2510,"Dorog","Pest"]
[null,null,null,null,null,null,null,null,null,null,null,null,null,null,null,null,null,null,null,null,3153,"Dorogháza","Győr-Moson-Sopron"]
[null,null,null,null,null,null,null,null,null,null,null,null,null,null,null,null,null,null,null,null,9913,"Döröske","Veszprém"]
[null,null,null,null,null,null,null,null,null,null,null,null,null,null,null,null,null,null,null,null,8799,"Dötk","Vas"]
[null,null,null,null,null,null,null,null,null,null,null,null,null,null,null,null,null,null,null,null,3721,"Dövény","Zala"]
[null,null,null,null,null,null,null,null,null,null,null,null,null,null,null,null,null,null,null,null,9791,"Dozmat","Borsod-Abaúj-Zemplén"]
[null,null,null,null,null,null,null,null,null,null,null,null,null,null,null,null,null,null,null,null,6342,"Drágszél","Bács-Kiskun"]
[null,null,null,null,null,null,null,null,null,null,null,null,null,null,null,null,null,null,null,null,7849,"Drávacsehi","Baranya"]
[null,null,null,null,null,null,null,null,null,null,null,null,null,null,null,null,null,null,null,null,7846,"Drávacsepely","Baranya"]
[null,null,null,null,null,null,null,null,null,null,null,null,null,null,null,null,null,null,null,null,7967,"Drávafok","Baranya"]
[null,null,null,null,null,null,null,null,null,null,null,null,null,null,null,null,null,null,null,null,7977,"Drávagárdony","Somogy"]
[null,null,null,null,null,null,null,null,null,null,null,null,null,null,null,null,null,null,null,null,7960,"Drávaiványi","Baranya"]
[null,null,null,null,null,null,null,null,null,null,null,null,null,null,null,null,null,null,null,null,7967,"Drávakeresztúr","Baranya"]
[null,null,null,null,null,null,null,null,null,null,null,null,null,null,null,null,null,null,null,null,7850,"Drávapalkonya","Baranya"]
[null,null,null,null,null,null,null,null,null,null,null,null,null,null,null,null,null,null,null,null,7843,"Drávapiski","Baranya"]
[null,null,null,null,null,null,null,null,null,null,null,null,null,null,null,null,null,null,null,null,7851,"Drávaszabolcs","Baranya"]
[null,null,null,null,null,null,null,null,null,null,null,null,null,null,null,null,null,null,null,null,7847,"Drávaszerdahely","Baranya"]
[null,null,null,null,null,null,null,null,null,null,null,null,null,null,null,null,null,null,null,null,7960,"Drávasztára","Baranya"]
[null,null,null,null,null,null,null,null,null,null,null,null,null,null,null,null,null,null,null,null,7979,"Drávatamási","Somogy"]
[null,null,null,null,null,null,null,null,null,null,null,null,null,null,null,null,null,null,null,null,2646,"Drégelypalánk","Nógrád"]
[null,null,null,null,null,null,null,null,null,null,null,null,null,null,null,null,null,null,null,null,3635,"Dubicsány","Borsod-Abaúj-Zemplén"]
[null,null,null,null,null,null,null,null,null,null,null,null,null,null,null,null,null,null,null,null,8416,"Dudar","Veszprém"]
[null,null,null,null,null,null,null,null,null,null,null,null,null,null,null,null,null,null,null,null,9556,"Duka","Vas"]
[null,null,null,null,null,null,null,null,null,null,null,null,null,null,null,null,null,null,null,null,2545,"Dunaalmás","Komárom-Esztergom"]
[null,null,null,null,null,null,null,null,null,null,null,null,null,null,null,null,null,null,null,null,2023,"Dunabogdány","Pest"]
[null,null,null,null,null,null,null,null,null,null,null,null,null,null,null,null,null,null,null,null,6323,"Dunaegyháza","Bács-Kiskun"]
[null,null,null,null,null,null,null,null,null,null,null,null,null,null,null,null,null,null,null,null,6513,"Dunafalva","Bács-Kiskun"]
[null,null,null,null,null,null,null,null,null,null,null,null,null,null,null,null,null,null,null,null,7020,"Dunaföldvár","Tolna"]
[null,null,null,null,null,null,null,null,null,null,null,null,null,null,null,null,null,null,null,null,2330,"Dunaharaszti","Pest"]
[null,null,null,null,null,null,null,null,null,null,null,null,null,null,null,null,null,null,null,null,2120,"Dunakeszi","Pest"]
[null,null,null,null,null,null,null,null,null,null,null,null,null,null,null,null,null,null,null,null,9225,"Dunakiliti","Győr-Moson-Sopron"]
[null,null,null,null,null,null,null,null,null,null,null,null,null,null,null,null,null,null,null,null,6328,"Dunapataj","Bács-Kiskun"]
[null,null,null,null,null,null,null,null,null,null,null,null,null,null,null,null,null,null,null,null,9235,"Dunaremete","Győr-Moson-Sopron"]
[null,null,null,null,null,null,null,null,null,null,null,null,null,null,null,null,null,null,null,null,9174,"Dunaszeg","Győr-Moson-Sopron"]
[null,null,null,null,null,null,null,null,null,null,null,null,null,null,null,null,null,null,null,null,7712,"Dunaszekcső","Baranya"]
[null,null,null,null,null,null,null,null,null,null,null,null,null,null,null,null,null,null,null,null,6333,"Dunaszentbenedek","Bács-Kiskun"]
[null,null,null,null,null,null,null,null,null,null,null,null,null,null,null,null,null,null,null,null,7135,"Dunaszentgyörgy","Tolna"]
[null,null,null,null,null,null,null,null,null,null,null,null,null,null,null,null,null,null,null,null,2897,"Dunaszentmiklós","Komárom-Esztergom"]
[null,null,null,null,null,null,null,null,null,null,null,null,null,null,null,null,null,null,null,null,9175,"Dunaszentpál","Győr-Moson-Sopron"]
[null,null,null,null,null,null,null,null,null,null,null,null,null,null,null,null,null,null,null,null,9226,"Dunasziget","Győr-Moson-Sopron"]
[null,null,null,null,null,null,null,null,null,null,null,null,null,null,null,null,null,null,null,null,6325,"Dunatetétlen","Bács-Kiskun"]
[null,null,null,null,null,null,null,null,null,null,null,null,null,null,null,null,null,null,null,null,2407,"Dunaújváros","Fejér"]
[null,null,null,null,null,null,null,null,null,null,null,null,null,null,null,null,null,null,null,null,2400,"Dunaújváros","Fejér"]
[null,null,null,null,null,null,null,null,null,null,null,null,null,null,null,null,null,null,null,null,2336,"Dunavarsány","Pest"]
[null,null,null,null,null,null,null,null,null,null,null,null,null,null,null,null,null,null,null,null,6087,"Dunavecse","Bács-Kiskun"]
[null,null,null,null,null,null,null,null,null,null,null,null,null,null,null,null,null,null,null,null,6353,"Dusnok","Bács-Kiskun"]
[null,null,null,null,null,null,null,null,null,null,null,null,null,null,null,null,null,null,null,null,7224,"Dúzs","Tolna"]
[null,null,null,null,null,null,null,null,null,null,null,null,null,null,null,null,null,null,null,null,9451,"Ebergőc","Győr-Moson-Sopron"]
[null,null,null,null,null,null,null,null,null,null,null,null,null,null,null,null,null,null,null,null,4211,"Ebes","Hajdú-Bihar"]
[null,null,null,null,null,null,null,null,null,null,null,null,null,null,null,null,null,null,null,null,9083,"Écs","Győr-Moson-Sopron"]
[null,null,null,null,null,null,null,null,null,null,null,null,null,null,null,null,null,null,null,null,3013,"Ecséd","Heves"]
[null,null,null,null,null,null,null,null,null,null,null,null,null,null,null,null,null,null,null,null,3053,"Ecseg","Nógrád"]
[null,null,null,null,null,null,null,null,null,null,null,null,null,null,null,null,null,null,null,null,5515,"Ecsegfalva","Békés"]
[null,null,null,null,null,null,null,null,null,null,null,null,null,null,null,null,null,null,null,null,7457,"Ecseny","Somogy"]
[null,null,null,null,null,null,null,null,null,null,null,null,null,null,null,null,null,null,null,null,2233,"Ecser","Pest"]
[null,null,null,null,null,null,null,null,null,null,null,null,null,null,null,null,null,null,null,null,7443,"Edde","Somogy"]
[null,null,null,null,null,null,null,null,null,null,null,null,null,null,null,null,null,null,null,null,3783,"Edelény","Borsod-Abaúj-Zemplén"]
[null,null,null,null,null,null,null,null,null,null,null,null,null,null,null,null,null,null,null,null,3780,"Edelény","Borsod-Abaúj-Zemplén"]
[null,null,null,null,null,null,null,null,null,null,null,null,null,null,null,null,null,null,null,null,9343,"Edve","Győr-Moson-Sopron"]
[null,null,null,null,null,null,null,null,null,null,null,null,null,null,null,null,null,null,null,null,3304,"Eger","Heves"]
[null,null,null,null,null,null,null,null,null,null,null,null,null,null,null,null,null,null,null,null,3323,"Eger","Heves"]
[null,null,null,null,null,null,null,null,null,null,null,null,null,null,null,null,null,null,null,null,3300,"Eger","Heves"]
[null,null,null,null,null,null,null,null,null,null,null,null,null,null,null,null,null,null,null,null,7763,"Egerág","Baranya"]
[null,null,null,null,null,null,null,null,null,null,null,null,null,null,null,null,null,null,null,null,8497,"Egeralja","Veszprém"]
[null,null,null,null,null,null,null,null,null,null,null,null,null,null,null,null,null,null,null,null,8765,"Egeraracsa","Zala"]
[null,null,null,null,null,null,null,null,null,null,null,null,null,null,null,null,null,null,null,null,3321,"Egerbakta","Heves"]
[null,null,null,null,null,null,null,null,null,null,null,null,null,null,null,null,null,null,null,null,3337,"Egerbocs","Heves"]
[null,null,null,null,null,null,null,null,null,null,null,null,null,null,null,null,null,null,null,null,3341,"Egercsehi","Heves"]
[null,null,null,null,null,null,null,null,null,null,null,null,null,null,null,null,null,null,null,null,3379,"Egerfarmos","Heves"]
[null,null,null,null,null,null,null,null,null,null,null,null,null,null,null,null,null,null,null,null,3461,"Egerlövő","Borsod-Abaúj-Zemplén"]
[null,null,null,null,null,null,null,null,null,null,null,null,null,null,null,null,null,null,null,null,3394,"Egerszalók","Heves"]
[null,null,null,null,null,null,null,null,null,null,null,null,null,null,null,null,null,null,null,null,3757,"Égerszög","Heves"]
[null,null,null,null,null,null,null,null,null,null,null,null,null,null,null,null,null,null,null,null,3328,"Egerszólát","Borsod-Abaúj-Zemplén"]
[null,null,null,null,null,null,null,null,null,null,null,null,null,null,null,null,null,null,null,null,8913,"Egervár","Zala"]
[null,null,null,null,null,null,null,null,null,null,null,null,null,null,null,null,null,null,null,null,9684,"Egervölgy","Vas"]
[null,null,null,null,null,null,null,null,null,null,null,null,null,null,null,null,null,null,null,null,9314,"Egyed","Győr-Moson-Sopron"]
[null,null,null,null,null,null,null,null,null,null,null,null,null,null,null,null,null,null,null,null,4067,"Egyek","Hajdú-Bihar"]
[null,null,null,null,null,null,null,null,null,null,null,null,null,null,null,null,null,null,null,null,4069,"Egyek","Hajdú-Bihar"]
[null,null,null,null,null,null,null,null,null,null,null,null,null,null,null,null,null,null,null,null,3043,"Egyházasdengeleg","Nógrád"]
[null,null,null,null,null,null,null,null,null,null,null,null,null,null,null,null,null,null,null,null,9473,"Egyházasfalu","Győr-Moson-Sopron"]
[null,null,null,null,null,null,null,null,null,null,null,null,null,null,null,null,null,null,null,null,3185,"Egyházasgerge","Nógrád"]
[null,null,null,null,null,null,null,null,null,null,null,null,null,null,null,null,null,null,null,null,7824,"Egyházasharaszti","Baranya"]
[null,null,null,null,null,null,null,null,null,null,null,null,null,null,null,null,null,null,null,null,9554,"Egyházashetye","Vas"]
[null,null,null,null,null,null,null,null,null,null,null,null,null,null,null,null,null,null,null,null,9781,"Egyházashollós","Vas"]
[null,null,null,null,null,null,null,null,null,null,null,null,null,null,null,null,null,null,null,null,8523,"Egyházaskesző","Veszprém"]
[null,null,null,null,null,null,null,null,null,null,null,null,null,null,null,null,null,null,null,null,7347,"Egyházaskozár","Baranya"]
[null,null,null,null,null,null,null,null,null,null,null,null,null,null,null,null,null,null,null,null,9783,"Egyházasrádóc","Vas"]
[null,null,null,null,null,null,null,null,null,null,null,null,null,null,null,null,null,null,null,null,5742,"Elek","Békés"]
[null,null,null,null,null,null,null,null,null,null,null,null,null,null,null,null,null,null,null,null,7744,"Ellend","Baranya"]
[null,null,null,null,null,null,null,null,null,null,null,null,null,null,null,null,null,null,null,null,2423,"Előszállás","Fejér"]
[null,null,null,null,null,null,null,null,null,null,null,null,null,null,null,null,null,null,null,null,2424,"Előszállás","Fejér"]
[null,null,null,null,null,null,null,null,null,null,null,null,null,null,null,null,null,null,null,null,3432,"Emőd","Borsod-Abaúj-Zemplén"]
[null,null,null,null,null,null,null,null,null,null,null,null,null,null,null,null,null,null,null,null,3854,"Encs","Borsod-Abaúj-Zemplén"]
[null,null,null,null,null,null,null,null,null,null,null,null,null,null,null,null,null,null,null,null,3860,"Encs","Borsod-Abaúj-Zemplén"]
[null,null,null,null,null,null,null,null,null,null,null,null,null,null,null,null,null,null,null,null,4374,"Encsencs","Szabolcs-Szatmár-Bereg"]
[null,null,null,null,null,null,null,null,null,null,null,null,null,null,null,null,null,null,null,null,3165,"Endrefalva","Nógrád"]
[null,null,null,null,null,null,null,null,null,null,null,null,null,null,null,null,null,null,null,null,7973,"Endrőc","Baranya"]
[null,null,null,null,null,null,null,null,null,null,null,null,null,null,null,null,null,null,null,null,9143,"Enese","Győr-Moson-Sopron"]
[null,null,null,null,null,null,null,null,null,null,null,null,null,null,null,null,null,null,null,null,8131,"Enying","Fejér"]
[null,null,null,null,null,null,null,null,null,null,null,null,null,null,null,null,null,null,null,null,8130,"Enying","Fejér"]
[null,null,null,null,null,null,null,null,null,null,null,null,null,null,null,null,null,null,null,null,6624,"Eperjes","Csongrád"]
[null,null,null,null,null,null,null,null,null,null,null,null,null,null,null,null,null,null,null,null,4646,"Eperjeske","Szabolcs-Szatmár-Bereg"]
[null,null,null,null,null,null,null,null,null,null,null,null,null,null,null,null,null,null,null,null,8413,"Eplény","Veszprém"]
[null,null,null,null,null,null,null,null,null,null,null,null,null,null,null,null,null,null,null,null,2526,"Epöl","Komárom-Esztergom"]
[null,null,null,null,null,null,null,null,null,null,null,null,null,null,null,null,null,null,null,null,2453,"Ercsi","Fejér"]
[null,null,null,null,null,null,null,null,null,null,null,null,null,null,null,null,null,null,null,null,2451,"Ercsi","Fejér"]
[null,null,null,null,null,null,null,null,null,null,null,null,null,null,null,null,null,null,null,null,2036,"Érd","Pest"]
[null,null,null,null,null,null,null,null,null,null,null,null,null,null,null,null,null,null,null,null,2035,"Érd","Pest"]
[null,null,null,null,null,null,null,null,null,null,null,null,null,null,null,null,null,null,null,null,2030,"Érd","Pest"]
[null,null,null,null,null,null,null,null,null,null,null,null,null,null,null,null,null,null,null,null,3932,"Erdőbénye","Borsod-Abaúj-Zemplén"]
[null,null,null,null,null,null,null,null,null,null,null,null,null,null,null,null,null,null,null,null,3935,"Erdőhorváti","Borsod-Abaúj-Zemplén"]
[null,null,null,null,null,null,null,null,null,null,null,null,null,null,null,null,null,null,null,null,2113,"Erdőkertes","Pest"]
[null,null,null,null,null,null,null,null,null,null,null,null,null,null,null,null,null,null,null,null,3252,"Erdőkövesd","Heves"]
[null,null,null,null,null,null,null,null,null,null,null,null,null,null,null,null,null,null,null,null,2176,"Erdőkürt","Nógrád"]
[null,null,null,null,null,null,null,null,null,null,null,null,null,null,null,null,null,null,null,null,7735,"Erdősmárok","Baranya"]
[null,null,null,null,null,null,null,null,null,null,null,null,null,null,null,null,null,null,null,null,7723,"Erdősmecske","Baranya"]
[null,null,null,null,null,null,null,null,null,null,null,null,null,null,null,null,null,null,null,null,2177,"Erdőtarcsa","Nógrád"]
[null,null,null,null,null,null,null,null,null,null,null,null,null,null,null,null,null,null,null,null,3358,"Erdőtelek","Heves"]
[null,null,null,null,null,null,null,null,null,null,null,null,null,null,null,null,null,null,null,null,3295,"Erk","Heves"]
[null,null,null,null,null,null,null,null,null,null,null,null,null,null,null,null,null,null,null,null,4245,"Érpatak","Szabolcs-Szatmár-Bereg"]
[null,null,null,null,null,null,null,null,null,null,null,null,null,null,null,null,null,null,null,null,6347,"Érsekcsanád","Bács-Kiskun"]
[null,null,null,null,null,null,null,null,null,null,null,null,null,null,null,null,null,null,null,null,6348,"Érsekhalma","Bács-Kiskun"]
[null,null,null,null,null,null,null,null,null,null,null,null,null,null,null,null,null,null,null,null,2659,"Érsekvadkert","Nógrád"]
[null,null,null,null,null,null,null,null,null,null,null,null,null,null,null,null,null,null,null,null,7093,"Értény","Tolna"]
[null,null,null,null,null,null,null,null,null,null,null,null,null,null,null,null,null,null,null,null,7661,"Erzsébet","Baranya"]
[null,null,null,null,null,null,null,null,null,null,null,null,null,null,null,null,null,null,null,null,4124,"Esztár","Hajdú-Bihar"]
[null,null,null,null,null,null,null,null,null,null,null,null,null,null,null,null,null,null,null,null,8882,"Eszteregnye","Zala"]
[null,null,null,null,null,null,null,null,null,null,null,null,null,null,null,null,null,null,null,null,8742,"Esztergályhorváti","Zala"]
[null,null,null,null,null,null,null,null,null,null,null,null,null,null,null,null,null,null,null,null,2509,"Esztergom","Komárom-Esztergom"]
[null,null,null,null,null,null,null,null,null,null,null,null,null,null,null,null,null,null,null,null,2500,"Esztergom","Komárom-Esztergom"]
[null,null,null,null,null,null,null,null,null,null,null,null,null,null,null,null,null,null,null,null,2947,"Ete","Komárom-Esztergom"]
[null,null,null,null,null,null,null,null,null,null,null,null,null,null,null,null,null,null,null,null,3136,"Etes","Nógrád"]
[null,null,null,null,null,null,null,null,null,null,null,null,null,null,null,null,null,null,null,null,2091,"Etyek","Fejér"]
[null,null,null,null,null,null,null,null,null,null,null,null,null,null,null,null,null,null,null,null,4354,"Fábiánháza","Szabolcs-Szatmár-Bereg"]
[null,null,null,null,null,null,null,null,null,null,null,null,null,null,null,null,null,null,null,null,6625,"Fábiánsebestyén","Csongrád"]
[null,null,null,null,null,null,null,null,null,null,null,null,null,null,null,null,null,null,null,null,7136,"Fácánkert","Tolna"]
[null,null,null,null,null,null,null,null,null,null,null,null,null,null,null,null,null,null,null,null,7139,"Fadd","Tolna"]
[null,null,null,null,null,null,null,null,null,null,null,null,null,null,null,null,null,null,null,null,7133,"Fadd","Tolna"]
[null,null,null,null,null,null,null,null,null,null,null,null,null,null,null,null,null,null,null,null,3865,"Fáj","Borsod-Abaúj-Zemplén"]
[null,null,null,null,null,null,null,null,null,null,null,null,null,null,null,null,null,null,null,null,6352,"Fajsz","Bács-Kiskun"]
[null,null,null,null,null,null,null,null,null,null,null,null,null,null,null,null,null,null,null,null,3855,"Fancsal","Borsod-Abaúj-Zemplén"]
[null,null,null,null,null,null,null,null,null,null,null,null,null,null,null,null,null,null,null,null,9321,"Farád","Győr-Moson-Sopron"]
[null,null,null,null,null,null,null,null,null,null,null,null,null,null,null,null,null,null,null,null,8582,"Farkasgyepű","Veszprém"]
[null,null,null,null,null,null,null,null,null,null,null,null,null,null,null,null,null,null,null,null,3608,"Farkaslyuk","Borsod-Abaúj-Zemplén"]
[null,null,null,null,null,null,null,null,null,null,null,null,null,null,null,null,null,null,null,null,2765,"Farmos","Pest"]
[null,null,null,null,null,null,null,null,null,null,null,null,null,null,null,null,null,null,null,null,7732,"Fazekasboda","Baranya"]
[null,null,null,null,null,null,null,null,null,null,null,null,null,null,null,null,null,null,null,null,3255,"Fedémes","Heves"]
[null,null,null,null,null,null,null,null,null,null,null,null,null,null,null,null,null,null,null,null,5213,"Fegyvernek","Jász-Nagykun-Szolnok"]
[null,null,null,null,null,null,null,null,null,null,null,null,null,null,null,null,null,null,null,null,5231,"Fegyvernek","Jász-Nagykun-Szolnok"]
[null,null,null,null,null,null,null,null,null,null,null,null,null,null,null,null,null,null,null,null,4900,"Fehérgyarmat","Szabolcs-Szatmár-Bereg"]
[null,null,null,null,null,null,null,null,null,null,null,null,null,null,null,null,null,null,null,null,9163,"Fehértó","Győr-Moson-Sopron"]
[null,null,null,null,null,null,null,null,null,null,null,null,null,null,null,null,null,null,null,null,8052,"Fehérvárcsurgó","Fejér"]
[null,null,null,null,null,null,null,null,null,null,null,null,null,null,null,null,null,null,null,null,7724,"Feked","Baranya"]
[null,null,null,null,null,null,null,null,null,null,null,null,null,null,null,null,null,null,null,null,9211,"Feketeerdő","Győr-Moson-Sopron"]
[null,null,null,null,null,null,null,null,null,null,null,null,null,null,null,null,null,null,null,null,8086,"Felcsút","Fejér"]
[null,null,null,null,null,null,null,null,null,null,null,null,null,null,null,null,null,null,null,null,3352,"Feldebrő","Heves"]
[null,null,null,null,null,null,null,null,null,null,null,null,null,null,null,null,null,null,null,null,6645,"Felgyő","Csongrád"]
[null,null,null,null,null,null,null,null,null,null,null,null,null,null,null,null,null,null,null,null,9122,"Felpéc","Győr-Moson-Sopron"]
[null,null,null,null,null,null,null,null,null,null,null,null,null,null,null,null,null,null,null,null,3985,"Felsőberecki","Borsod-Abaúj-Zemplén"]
[null,null,null,null,null,null,null,null,null,null,null,null,null,null,null,null,null,null,null,null,9794,"Felsőcsatár","Vas"]
[null,null,null,null,null,null,null,null,null,null,null,null,null,null,null,null,null,null,null,null,3847,"Felsődobsza","Borsod-Abaúj-Zemplén"]
[null,null,null,null,null,null,null,null,null,null,null,null,null,null,null,null,null,null,null,null,7370,"Felsőegerszeg","Baranya"]
[null,null,null,null,null,null,null,null,null,null,null,null,null,null,null,null,null,null,null,null,3837,"Felsőgagy","Borsod-Abaúj-Zemplén"]
[null,null,null,null,null,null,null,null,null,null,null,null,null,null,null,null,null,null,null,null,9934,"Felsőjánosfa","Vas"]
[null,null,null,null,null,null,null,null,null,null,null,null,null,null,null,null,null,null,null,null,3722,"Felsőkelecsény","Borsod-Abaúj-Zemplén"]
[null,null,null,null,null,null,null,null,null,null,null,null,null,null,null,null,null,null,null,null,6055,"Felsőlajos","Bács-Kiskun"]
[null,null,null,null,null,null,null,null,null,null,null,null,null,null,null,null,null,null,null,null,9918,"Felsőmarác","Vas"]
[null,null,null,null,null,null,null,null,null,null,null,null,null,null,null,null,null,null,null,null,7456,"Felsőmocsolád","Somogy"]
[null,null,null,null,null,null,null,null,null,null,null,null,null,null,null,null,null,null,null,null,7175,"Felsőnána","Tolna"]
[null,null,null,null,null,null,null,null,null,null,null,null,null,null,null,null,null,null,null,null,3721,"Felsőnyárád","Borsod-Abaúj-Zemplén"]
[null,null,null,null,null,null,null,null,null,null,null,null,null,null,null,null,null,null,null,null,7099,"Felsőnyék","Tolna"]
[null,null,null,null,null,null,null,null,null,null,null,null,null,null,null,null,null,null,null,null,8227,"Felsőörs","Veszprém"]
[null,null,null,null,null,null,null,null,null,null,null,null,null,null,null,null,null,null,null,null,8380,"Felsőpáhok","Zala"]
[null,null,null,null,null,null,null,null,null,null,null,null,null,null,null,null,null,null,null,null,2363,"Felsőpakony","Pest"]
[null,null,null,null,null,null,null,null,null,null,null,null,null,null,null,null,null,null,null,null,2611,"Felsőpetény","Nógrád"]
[null,null,null,null,null,null,null,null,null,null,null,null,null,null,null,null,null,null,null,null,8767,"Felsőrajk","Zala"]
[null,null,null,null,null,null,null,null,null,null,null,null,null,null,null,null,null,null,null,null,3989,"Felsőregmec","Borsod-Abaúj-Zemplén"]
[null,null,null,null,null,null,null,null,null,null,null,null,null,null,null,null,null,null,null,null,8973,"Felsőszenterzsébet","Zala"]
[null,null,null,null,null,null,null,null,null,null,null,null,null,null,null,null,null,null,null,null,6447,"Felsőszentiván","Bács-Kiskun"]
[null,null,null,null,null,null,null,null,null,null,null,null,null,null,null,null,null,null,null,null,7968,"Felsőszentmárton","Baranya"]
[null,null,null,null,null,null,null,null,null,null,null,null,null,null,null,null,null,null,null,null,9985,"Felsőszölnök","Vas"]
[null,null,null,null,null,null,null,null,null,null,null,null,null,null,null,null,null,null,null,null,3324,"Felsőtárkány","Heves"]
[null,null,null,null,null,null,null,null,null,null,null,null,null,null,null,null,null,null,null,null,3735,"Felsőtelekes","Borsod-Abaúj-Zemplén"]
[null,null,null,null,null,null,null,null,null,null,null,null,null,null,null,null,null,null,null,null,3067,"Felsőtold","Nógrád"]
[null,null,null,null,null,null,null,null,null,null,null,null,null,null,null,null,null,null,null,null,3814,"Felsővadász","Borsod-Abaúj-Zemplén"]
[null,null,null,null,null,null,null,null,null,null,null,null,null,null,null,null,null,null,null,null,3561,"Felsőzsolca","Borsod-Abaúj-Zemplén"]
[null,null,null,null,null,null,null,null,null,null,null,null,null,null,null,null,null,null,null,null,4621,"Fényeslitke","Szabolcs-Szatmár-Bereg"]
[null,null,null,null,null,null,null,null,null,null,null,null,null,null,null,null,null,null,null,null,8432,"Fenyőfő","Veszprém"]
[null,null,null,null,null,null,null,null,null,null,null,null,null,null,null,null,null,null,null,null,6774,"Ferencszállás","Csongrád"]
[null,null,null,null,null,null,null,null,null,null,null,null,null,null,null,null,null,null,null,null,9493,"Fertőboz","Győr-Moson-Sopron"]
[null,null,null,null,null,null,null,null,null,null,null,null,null,null,null,null,null,null,null,null,9433,"Fertőd","Győr-Moson-Sopron"]
[null,null,null,null,null,null,null,null,null,null,null,null,null,null,null,null,null,null,null,null,9431,"Fertőd","Győr-Moson-Sopron"]
[null,null,null,null,null,null,null,null,null,null,null,null,null,null,null,null,null,null,null,null,9442,"Fertőendréd","Győr-Moson-Sopron"]
[null,null,null,null,null,null,null,null,null,null,null,null,null,null,null,null,null,null,null,null,9492,"Fertőhomok","Győr-Moson-Sopron"]
[null,null,null,null,null,null,null,null,null,null,null,null,null,null,null,null,null,null,null,null,9421,"Fertőrákos","Győr-Moson-Sopron"]
[null,null,null,null,null,null,null,null,null,null,null,null,null,null,null,null,null,null,null,null,9444,"Fertőszentmiklós","Győr-Moson-Sopron"]
[null,null,null,null,null,null,null,null,null,null,null,null,null,null,null,null,null,null,null,null,9436,"Fertőszéplak","Győr-Moson-Sopron"]
[null,null,null,null,null,null,null,null,null,null,null,null,null,null,null,null,null,null,null,null,7282,"Fiad","Somogy"]
[null,null,null,null,null,null,null,null,null,null,null,null,null,null,null,null,null,null,null,null,3994,"Filkeháza","Borsod-Abaúj-Zemplén"]
[null,null,null,null,null,null,null,null,null,null,null,null,null,null,null,null,null,null,null,null,8835,"Fityeház","Zala"]
[null,null,null,null,null,null,null,null,null,null,null,null,null,null,null,null,null,null,null,null,6331,"Foktő","Bács-Kiskun"]
[null,null,null,null,null,null,null,null,null,null,null,null,null,null,null,null,null,null,null,null,6922,"Földeák","Hajdú-Bihar"]
[null,null,null,null,null,null,null,null,null,null,null,null,null,null,null,null,null,null,null,null,4177,"Földes","Somogy"]
[null,null,null,null,null,null,null,null,null,null,null,null,null,null,null,null,null,null,null,null,4090,"Folyás","Borsod-Abaúj-Zemplén"]
[null,null,null,null,null,null,null,null,null,null,null,null,null,null,null,null,null,null,null,null,7271,"Fonó","Somogy"]
[null,null,null,null,null,null,null,null,null,null,null,null,null,null,null,null,null,null,null,null,3893,"Fony","Somogy"]
[null,null,null,null,null,null,null,null,null,null,null,null,null,null,null,null,null,null,null,null,8732,"Főnyed","Csongrád"]
[null,null,null,null,null,null,null,null,null,null,null,null,null,null,null,null,null,null,null,null,8644,"Fonyód","Borsod-Abaúj-Zemplén"]
[null,null,null,null,null,null,null,null,null,null,null,null,null,null,null,null,null,null,null,null,8640,"Fonyód","Pest"]
[null,null,null,null,null,null,null,null,null,null,null,null,null,null,null,null,null,null,null,null,6793,"Forráskút","Csongrád"]
[null,null,null,null,null,null,null,null,null,null,null,null,null,null,null,null,null,null,null,null,3849,"Forró","Hajdú-Bihar"]
[null,null,null,null,null,null,null,null,null,null,null,null,null,null,null,null,null,null,null,null,2151,"Fót","Somogy"]
[null,null,null,null,null,null,null,null,null,null,null,null,null,null,null,null,null,null,null,null,8157,"Füle","Borsod-Abaúj-Zemplén"]
[null,null,null,null,null,null,null,null,null,null,null,null,null,null,null,null,null,null,null,null,4964,"Fülesd","Hajdú-Bihar"]
[null,null,null,null,null,null,null,null,null,null,null,null,null,null,null,null,null,null,null,null,3864,"Fulókércs","Fejér"]
[null,null,null,null,null,null,null,null,null,null,null,null,null,null,null,null,null,null,null,null,4266,"Fülöp","Szabolcs-Szatmár-Bereg"]
[null,null,null,null,null,null,null,null,null,null,null,null,null,null,null,null,null,null,null,null,6042,"Fülöpháza","Hajdú-Bihar"]
[null,null,null,null,null,null,null,null,null,null,null,null,null,null,null,null,null,null,null,null,6116,"Fülöpjakab","Bács-Kiskun"]
[null,null,null,null,null,null,null,null,null,null,null,null,null,null,null,null,null,null,null,null,6085,"Fülöpszállás","Bács-Kiskun"]
[null,null,null,null,null,null,null,null,null,null,null,null,null,null,null,null,null,null,null,null,4754,"Fülpösdaróc","Bács-Kiskun"]
[null,null,null,null,null,null,null,null,null,null,null,null,null,null,null,null,null,null,null,null,7087,"Fürged","Szabolcs-Szatmár-Bereg"]
[null,null,null,null,null,null,null,null,null,null,null,null,null,null,null,null,null,null,null,null,4141,"Furta","Tolna"]
[null,null,null,null,null,null,null,null,null,null,null,null,null,null,null,null,null,null,null,null,3996,"Füzér","Borsod-Abaúj-Zemplén"]
[null,null,null,null,null,null,null,null,null,null,null,null,null,null,null,null,null,null,null,null,3994,"Füzérkajata","Borsod-Abaúj-Zemplén"]
[null,null,null,null,null,null,null,null,null,null,null,null,null,null,null,null,null,null,null,null,3997,"Füzérkomlós","Borsod-Abaúj-Zemplén"]
[null,null,null,null,null,null,null,null,null,null,null,null,null,null,null,null,null,null,null,null,3993,"Füzérradvány","Borsod-Abaúj-Zemplén"]
[null,null,null,null,null,null,null,null,null,null,null,null,null,null,null,null,null,null,null,null,3390,"Füzesabony","Heves"]
[null,null,null,null,null,null,null,null,null,null,null,null,null,null,null,null,null,null,null,null,5525,"Füzesgyarmat","Békés"]
[null,null,null,null,null,null,null,null,null,null,null,null,null,null,null,null,null,null,null,null,8777,"Füzvölgy","Zala"]
[null,null,null,null,null,null,null,null,null,null,null,null,null,null,null,null,null,null,null,null,4122,"Gáborján","Hajdú-Bihar"]
[null,null,null,null,null,null,null,null,null,null,null,null,null,null,null,null,null,null,null,null,8969,"Gáborjánháza","Zala"]
[null,null,null,null,null,null,null,null,null,null,null,null,null,null,null,null,null,null,null,null,4972,"Gacsály","Szabolcs-Szatmár-Bereg"]
[null,null,null,null,null,null,null,null,null,null,null,null,null,null,null,null,null,null,null,null,7276,"Gadács","Somogy"]
[null,null,null,null,null,null,null,null,null,null,null,null,null,null,null,null,null,null,null,null,8716,"Gadány","Somogy"]
[null,null,null,null,null,null,null,null,null,null,null,null,null,null,null,null,null,null,null,null,3815,"Gadna","Borsod-Abaúj-Zemplén"]
[null,null,null,null,null,null,null,null,null,null,null,null,null,null,null,null,null,null,null,null,5932,"Gádoros","Békés"]
[null,null,null,null,null,null,null,null,null,null,null,null,null,null,null,null,null,null,null,null,3837,"Gagyapáti","Borsod-Abaúj-Zemplén"]
[null,null,null,null,null,null,null,null,null,null,null,null,null,null,null,null,null,null,null,null,3817,"Gagybátor","Borsod-Abaúj-Zemplén"]
[null,null,null,null,null,null,null,null,null,null,null,null,null,null,null,null,null,null,null,null,3816,"Gagyvendégi","Borsod-Abaúj-Zemplén"]
[null,null,null,null,null,null,null,null,null,null,null,null,null,null,null,null,null,null,null,null,8754,"Galambok","Zala"]
[null,null,null,null,null,null,null,null,null,null,null,null,null,null,null,null,null,null,null,null,2686,"Galgaguta","Nógrád"]
[null,null,null,null,null,null,null,null,null,null,null,null,null,null,null,null,null,null,null,null,2681,"Galgagyörk","Pest"]
[null,null,null,null,null,null,null,null,null,null,null,null,null,null,null,null,null,null,null,null,2193,"Galgahévíz","Pest"]
[null,null,null,null,null,null,null,null,null,null,null,null,null,null,null,null,null,null,null,null,2183,"Galgamácsa","Pest"]
[null,null,null,null,null,null,null,null,null,null,null,null,null,null,null,null,null,null,null,null,7473,"Gálosfa","Somogy"]
[null,null,null,null,null,null,null,null,null,null,null,null,null,null,null,null,null,null,null,null,3752,"Galvács","Borsod-Abaúj-Zemplén"]
[null,null,null,null,null,null,null,null,null,null,null,null,null,null,null,null,null,null,null,null,8685,"Gamás","Somogy"]
[null,null,null,null,null,null,null,null,null,null,null,null,null,null,null,null,null,null,null,null,8597,"Ganna","Veszprém"]
[null,null,null,null,null,null,null,null,null,null,null,null,null,null,null,null,null,null,null,null,8082,"Gánt","Fejér"]
[null,null,null,null,null,null,null,null,null,null,null,null,null,null,null,null,null,null,null,null,6522,"Gara","Bács-Kiskun"]
[null,null,null,null,null,null,null,null,null,null,null,null,null,null,null,null,null,null,null,null,3067,"Garáb","Nógrád"]
[null,null,null,null,null,null,null,null,null,null,null,null,null,null,null,null,null,null,null,null,8747,"Garabonc","Zala"]
[null,null,null,null,null,null,null,null,null,null,null,null,null,null,null,null,null,null,null,null,3873,"Garadna","Borsod-Abaúj-Zemplén"]
[null,null,null,null,null,null,null,null,null,null,null,null,null,null,null,null,null,null,null,null,4976,"Garbolc","Szabolcs-Szatmár-Bereg"]
[null,null,null,null,null,null,null,null,null,null,null,null,null,null,null,null,null,null,null,null,2484,"Gárdony","Fejér"]
[null,null,null,null,null,null,null,null,null,null,null,null,null,null,null,null,null,null,null,null,2485,"Gárdony","Fejér"]
[null,null,null,null,null,null,null,null,null,null,null,null,null,null,null,null,null,null,null,null,2483,"Gárdony","Fejér"]
[null,null,null,null,null,null,null,null,null,null,null,null,null,null,null,null,null,null,null,null,7812,"Garé","Baranya"]
[null,null,null,null,null,null,null,null,null,null,null,null,null,null,null,null,null,null,null,null,9952,"Gasztony","Vas"]
[null,null,null,null,null,null,null,null,null,null,null,null,null,null,null,null,null,null,null,null,6111,"Gátér","Bács-Kiskun"]
[null,null,null,null,null,null,null,null,null,null,null,null,null,null,null,null,null,null,null,null,4471,"Gávavencsellő","Szabolcs-Szatmár-Bereg"]
[null,null,null,null,null,null,null,null,null,null,null,null,null,null,null,null,null,null,null,null,4472,"Gávavencsellő","Szabolcs-Szatmár-Bereg"]
[null,null,null,null,null,null,null,null,null,null,null,null,null,null,null,null,null,null,null,null,4754,"Géberjén","Szabolcs-Szatmár-Bereg"]
[null,null,null,null,null,null,null,null,null,null,null,null,null,null,null,null,null,null,null,null,8543,"Gecse","Veszprém"]
[null,null,null,null,null,null,null,null,null,null,null,null,null,null,null,null,null,null,null,null,6334,"Géderlak","Bács-Kiskun"]
[null,null,null,null,null,null,null,null,null,null,null,null,null,null,null,null,null,null,null,null,4517,"Gégény","Szabolcs-Szatmár-Bereg"]
[null,null,null,null,null,null,null,null,null,null,null,null,null,null,null,null,null,null,null,null,3444,"Gelej","Borsod-Abaúj-Zemplén"]
[null,null,null,null,null,null,null,null,null,null,null,null,null,null,null,null,null,null,null,null,4935,"Gelénes","Szabolcs-Szatmár-Bereg"]
[null,null,null,null,null,null,null,null,null,null,null,null,null,null,null,null,null,null,null,null,8981,"Gellénháza","Zala"]
[null,null,null,null,null,null,null,null,null,null,null,null,null,null,null,null,null,null,null,null,8774,"Gelse","Zala"]
[null,null,null,null,null,null,null,null,null,null,null,null,null,null,null,null,null,null,null,null,8774,"Gelsesziget","Zala"]
[null,null,null,null,null,null,null,null,null,null,null,null,null,null,null,null,null,null,null,null,4567,"Gemzse","Szabolcs-Szatmár-Bereg"]
[null,null,null,null,null,null,null,null,null,null,null,null,null,null,null,null,null,null,null,null,9721,"Gencsapáti","Vas"]
[null,null,null,null,null,null,null,null,null,null,null,null,null,null,null,null,null,null,null,null,9672,"Gérce","Vas"]
[null,null,null,null,null,null,null,null,null,null,null,null,null,null,null,null,null,null,null,null,7951,"Gerde","Baranya"]
[null,null,null,null,null,null,null,null,null,null,null,null,null,null,null,null,null,null,null,null,5925,"Gerendás","Békés"]
[null,null,null,null,null,null,null,null,null,null,null,null,null,null,null,null,null,null,null,null,7362,"Gerényes","Baranya"]
[null,null,null,null,null,null,null,null,null,null,null,null,null,null,null,null,null,null,null,null,7733,"Geresdlak","Baranya"]
[null,null,null,null,null,null,null,null,null,null,null,null,null,null,null,null,null,null,null,null,7134,"Gerjen","Tolna"]
[null,null,null,null,null,null,null,null,null,null,null,null,null,null,null,null,null,null,null,null,9813,"Gersekarát","Vas"]
[null,null,null,null,null,null,null,null,null,null,null,null,null,null,null,null,null,null,null,null,5734,"Geszt","Békés"]
[null,null,null,null,null,null,null,null,null,null,null,null,null,null,null,null,null,null,null,null,3923,"Gesztely","Borsod-Abaúj-Zemplén"]
[null,null,null,null,null,null,null,null,null,null,null,null,null,null,null,null,null,null,null,null,3715,"Gesztely","Borsod-Abaúj-Zemplén"]
[null,null,null,null,null,null,null,null,null,null,null,null,null,null,null,null,null,null,null,null,4232,"Geszteréd","Szabolcs-Szatmár-Bereg"]
[null,null,null,null,null,null,null,null,null,null,null,null,null,null,null,null,null,null,null,null,8762,"Gétye","Zala"]
[null,null,null,null,null,null,null,null,null,null,null,null,null,null,null,null,null,null,null,null,8435,"Gic","Veszprém"]
[null,null,null,null,null,null,null,null,null,null,null,null,null,null,null,null,null,null,null,null,7527,"Gige","Somogy"]
[null,null,null,null,null,null,null,null,null,null,null,null,null,null,null,null,null,null,null,null,7954,"Gilvánfa","Baranya"]
[null,null,null,null,null,null,null,null,null,null,null,null,null,null,null,null,null,null,null,null,3578,"Girincs","Borsod-Abaúj-Zemplén"]
[null,null,null,null,null,null,null,null,null,null,null,null,null,null,null,null,null,null,null,null,2131,"Göd","Veszprém"]
[null,null,null,null,null,null,null,null,null,null,null,null,null,null,null,null,null,null,null,null,2132,"Göd","Borsod-Abaúj-Zemplén"]
[null,null,null,null,null,null,null,null,null,null,null,null,null,null,null,null,null,null,null,null,2100,"Gödöllő","Pest"]
[null,null,null,null,null,null,null,null,null,null,null,null,null,null,null,null,null,null,null,null,7386,"Gödre","Zala"]
[null,null,null,null,null,null,null,null,null,null,null,null,null,null,null,null,null,null,null,null,7385,"Gödre","Vas"]
[null,null,null,null,null,null,null,null,null,null,null,null,null,null,null,null,null,null,null,null,8346,"Gógánfa","Baranya"]
[null,null,null,null,null,null,null,null,null,null,null,null,null,null,null,null,null,null,null,null,7272,"Gölle","Zala"]
[null,null,null,null,null,null,null,null,null,null,null,null,null,null,null,null,null,null,null,null,3906,"Golop","Pest"]
[null,null,null,null,null,null,null,null,null,null,null,null,null,null,null,null,null,null,null,null,2217,"Gomba","Pest"]
[null,null,null,null,null,null,null,null,null,null,null,null,null,null,null,null,null,null,null,null,8984,"Gombosszeg","Pest"]
[null,null,null,null,null,null,null,null,null,null,null,null,null,null,null,null,null,null,null,null,3728,"Gömörszőlős","Baranya"]
[null,null,null,null,null,null,null,null,null,null,null,null,null,null,null,null,null,null,null,null,3895,"Gönc","Baranya"]
[null,null,null,null,null,null,null,null,null,null,null,null,null,null,null,null,null,null,null,null,3894,"Göncruszka","Somogy"]
[null,null,null,null,null,null,null,null,null,null,null,null,null,null,null,null,null,null,null,null,9071,"Gönyű","Borsod-Abaúj-Zemplén"]
[null,null,null,null,null,null,null,null,null,null,null,null,null,null,null,null,null,null,null,null,9625,"Gór","Borsod-Abaúj-Zemplén"]
[null,null,null,null,null,null,null,null,null,null,null,null,null,null,null,null,null,null,null,null,4075,"Görbeháza","Borsod-Abaúj-Zemplén"]
[null,null,null,null,null,null,null,null,null,null,null,null,null,null,null,null,null,null,null,null,7833,"Görcsöny","Győr-Moson-Sopron"]
[null,null,null,null,null,null,null,null,null,null,null,null,null,null,null,null,null,null,null,null,7728,"Görcsönydoboka","Hajdú-Bihar"]
[null,null,null,null,null,null,null,null,null,null,null,null,null,null,null,null,null,null,null,null,7853,"Gordisa","Baranya"]
[null,null,null,null,null,null,null,null,null,null,null,null,null,null,null,null,null,null,null,null,7553,"Görgeteg","Baranya"]
[null,null,null,null,null,null,null,null,null,null,null,null,null,null,null,null,null,null,null,null,8913,"Gősfa","Somogy"]
[null,null,null,null,null,null,null,null,null,null,null,null,null,null,null,null,null,null,null,null,8978,"Gosztola","Zala"]
[null,null,null,null,null,null,null,null,null,null,null,null,null,null,null,null,null,null,null,null,7162,"Grábóc","Tolna"]
[null,null,null,null,null,null,null,null,null,null,null,null,null,null,null,null,null,null,null,null,4842,"Gulács","Szabolcs-Szatmár-Bereg"]
[null,null,null,null,null,null,null,null,null,null,null,null,null,null,null,null,null,null,null,null,8951,"Gutorfölde","Zala"]
[null,null,null,null,null,null,null,null,null,null,null,null,null,null,null,null,null,null,null,null,2360,"Gyál","Pest"]
[null,null,null,null,null,null,null,null,null,null,null,null,null,null,null,null,null,null,null,null,9474,"Gyalóka","Győr-Moson-Sopron"]
[null,null,null,null,null,null,null,null,null,null,null,null,null,null,null,null,null,null,null,null,9774,"Gyanógeregye","Vas"]
[null,null,null,null,null,null,null,null,null,null,null,null,null,null,null,null,null,null,null,null,9126,"Gyarmat","Győr-Moson-Sopron"]
[null,null,null,null,null,null,null,null,null,null,null,null,null,null,null,null,null,null,null,null,8851,"Gyékényes","Somogy"]
[null,null,null,null,null,null,null,null,null,null,null,null,null,null,null,null,null,null,null,null,8315,"Gyenesdiás","Zala"]
[null,null,null,null,null,null,null,null,null,null,null,null,null,null,null,null,null,null,null,null,8473,"Gyepükaján","Veszprém"]
[null,null,null,null,null,null,null,null,null,null,null,null,null,null,null,null,null,null,null,null,2821,"Gyermely","Komárom-Esztergom"]
[null,null,null,null,null,null,null,null,null,null,null,null,null,null,null,null,null,null,null,null,7668,"Gyód","Baranya"]
[null,null,null,null,null,null,null,null,null,null,null,null,null,null,null,null,null,null,null,null,5502,"Gyomaendrőd","Békés"]
[null,null,null,null,null,null,null,null,null,null,null,null,null,null,null,null,null,null,null,null,5500,"Gyomaendrőd","Békés"]
[null,null,null,null,null,null,null,null,null,null,null,null,null,null,null,null,null,null,null,null,9124,"Gyömöre","Győr-Moson-Sopron"]
[null,null,null,null,null,null,null,null,null,null,null,null,null,null,null,null,null,null,null,null,2230,"Gyömrő","Győr-Moson-Sopron"]
[null,null,null,null,null,null,null,null,null,null,null,null,null,null,null,null,null,null,null,null,7954,"Gyöngyfa","Pest"]
[null,null,null,null,null,null,null,null,null,null,null,null,null,null,null,null,null,null,null,null,3221,"Gyöngyös","Baranya"]
[null,null,null,null,null,null,null,null,null,null,null,null,null,null,null,null,null,null,null,null,3232,"Gyöngyös","Heves"]
[null,null,null,null,null,null,null,null,null,null,null,null,null,null,null,null,null,null,null,null,3233,"Gyöngyös","Heves"]
[null,null,null,null,null,null,null,null,null,null,null,null,null,null,null,null,null,null,null,null,3200,"Gyöngyös","Heves"]
[null,null,null,null,null,null,null,null,null,null,null,null,null,null,null,null,null,null,null,null,9723,"Gyöngyösfalu","Heves"]
[null,null,null,null,null,null,null,null,null,null,null,null,null,null,null,null,null,null,null,null,3212,"Gyöngyöshalász","Vas"]
[null,null,null,null,null,null,null,null,null,null,null,null,null,null,null,null,null,null,null,null,7972,"Gyöngyösmellék","Heves"]
[null,null,null,null,null,null,null,null,null,null,null,null,null,null,null,null,null,null,null,null,3211,"Gyöngyösoroszi","Baranya"]
[null,null,null,null,null,null,null,null,null,null,null,null,null,null,null,null,null,null,null,null,3035,"Gyöngyöspata","Heves"]
[null,null,null,null,null,null,null,null,null,null,null,null,null,null,null,null,null,null,null,null,3231,"Gyöngyössolymos","Heves"]
[null,null,null,null,null,null,null,null,null,null,null,null,null,null,null,null,null,null,null,null,3036,"Gyöngyöstarján","Heves"]
[null,null,null,null,null,null,null,null,null,null,null,null,null,null,null,null,null,null,null,null,7064,"Gyönk","Heves"]
[null,null,null,null,null,null,null,null,null,null,null,null,null,null,null,null,null,null,null,null,9019,"Győr","Tolna"]
[null,null,null,null,null,null,null,null,null,null,null,null,null,null,null,null,null,null,null,null,9011,"Győr","Győr-Moson-Sopron"]
[null,null,null,null,null,null,null,null,null,null,null,null,null,null,null,null,null,null,null,null,9012,"Győr","Győr-Moson-Sopron"]
[null,null,null,null,null,null,null,null,null,null,null,null,null,null,null,null,null,null,null,null,9000,"Győr","Győr-Moson-Sopron"]
[null,null,null,null,null,null,null,null,null,null,null,null,null,null,null,null,null,null,null,null,9021,"Győr","Győr-Moson-Sopron"]
[null,null,null,null,null,null,null,null,null,null,null,null,null,null,null,null,null,null,null,null,9022,"Győr","Győr-Moson-Sopron"]
[null,null,null,null,null,null,null,null,null,null,null,null,null,null,null,null,null,null,null,null,9023,"Győr","Győr-Moson-Sopron"]
[null,null,null,null,null,null,null,null,null,null,null,null,null,null,null,null,null,null,null,null,9024,"Győr","Győr-Moson-Sopron"]
[null,null,null,null,null,null,null,null,null,null,null,null,null,null,null,null,null,null,null,null,9025,"Győr","Győr-Moson-Sopron"]
[null,null,null,null,null,null,null,null,null,null,null,null,null,null,null,null,null,null,null,null,9026,"Győr","Győr-Moson-Sopron"]
[null,null,null,null,null,null,null,null,null,null,null,null,null,null,null,null,null,null,null,null,9027,"Győr","Győr-Moson-Sopron"]
[null,null,null,null,null,null,null,null,null,null,null,null,null,null,null,null,null,null,null,null,9028,"Győr","Győr-Moson-Sopron"]
[null,null,null,null,null,null,null,null,null,null,null,null,null,null,null,null,null,null,null,null,9029,"Győr","Győr-Moson-Sopron"]
[null,null,null,null,null,null,null,null,null,null,null,null,null,null,null,null,null,null,null,null,9030,"Győr","Győr-Moson-Sopron"]
[null,null,null,null,null,null,null,null,null,null,null,null,null,null,null,null,null,null,null,null,9093,"Győrasszonyfa","Győr-Moson-Sopron"]
[null,null,null,null,null,null,null,null,null,null,null,null,null,null,null,null,null,null,null,null,7352,"Györe","Győr-Moson-Sopron"]
[null,null,null,null,null,null,null,null,null,null,null,null,null,null,null,null,null,null,null,null,3954,"Györgytarló","Tolna"]
[null,null,null,null,null,null,null,null,null,null,null,null,null,null,null,null,null,null,null,null,7045,"Györköny","Borsod-Abaúj-Zemplén"]
[null,null,null,null,null,null,null,null,null,null,null,null,null,null,null,null,null,null,null,null,9173,"Győrladamér","Tolna"]
[null,null,null,null,null,null,null,null,null,null,null,null,null,null,null,null,null,null,null,null,9363,"Gyóró","Győr-Moson-Sopron"]
[null,null,null,null,null,null,null,null,null,null,null,null,null,null,null,null,null,null,null,null,4625,"Győröcske","Szabolcs-Szatmár-Bereg"]
[null,null,null,null,null,null,null,null,null,null,null,null,null,null,null,null,null,null,null,null,9084,"Győrság","Győr-Moson-Sopron"]
[null,null,null,null,null,null,null,null,null,null,null,null,null,null,null,null,null,null,null,null,9161,"Győrsövényház","Győr-Moson-Sopron"]
[null,null,null,null,null,null,null,null,null,null,null,null,null,null,null,null,null,null,null,null,9121,"Győrszemere","Győr-Moson-Sopron"]
[null,null,null,null,null,null,null,null,null,null,null,null,null,null,null,null,null,null,null,null,4752,"Győrtelek","Szabolcs-Szatmár-Bereg"]
[null,null,null,null,null,null,null,null,null,null,null,null,null,null,null,null,null,null,null,null,9081,"Győrújbarát","Győr-Moson-Sopron"]
[null,null,null,null,null,null,null,null,null,null,null,null,null,null,null,null,null,null,null,null,9171,"Győrújfalu","Győr-Moson-Sopron"]
[null,null,null,null,null,null,null,null,null,null,null,null,null,null,null,null,null,null,null,null,9821,"Győrvár","Vas"]
[null,null,null,null,null,null,null,null,null,null,null,null,null,null,null,null,null,null,null,null,9172,"Győrzámoly","Győr-Moson-Sopron"]
[null,null,null,null,null,null,null,null,null,null,null,null,null,null,null,null,null,null,null,null,8692,"Gyugy","Somogy"]
[null,null,null,null,null,null,null,null,null,null,null,null,null,null,null,null,null,null,null,null,4733,"Gyügye","Békés"]
[null,null,null,null,null,null,null,null,null,null,null,null,null,null,null,null,null,null,null,null,5711,"Gyula","Békés"]
[null,null,null,null,null,null,null,null,null,null,null,null,null,null,null,null,null,null,null,null,5703,"Gyula","Békés"]
[null,null,null,null,null,null,null,null,null,null,null,null,null,null,null,null,null,null,null,null,5700,"Gyula","Szabolcs-Szatmár-Bereg"]
[null,null,null,null,null,null,null,null,null,null,null,null,null,null,null,null,null,null,null,null,4545,"Gyulaháza","Tolna"]
[null,null,null,null,null,null,null,null,null,null,null,null,null,null,null,null,null,null,null,null,7227,"Gyulaj","Veszprém"]
[null,null,null,null,null,null,null,null,null,null,null,null,null,null,null,null,null,null,null,null,8286,"Gyulakeszi","Fejér"]
[null,null,null,null,null,null,null,null,null,null,null,null,null,null,null,null,null,null,null,null,4813,"Gyüre","Szabolcs-Szatmár-Bereg"]
[null,null,null,null,null,null,null,null,null,null,null,null,null,null,null,null,null,null,null,null,2464,"Gyúró","Szabolcs-Szatmár-Bereg"]
[null,null,null,null,null,null,null,null,null,null,null,null,null,null,null,null,null,null,null,null,8932,"Gyűrűs","Zala"]
[null,null,null,null,null,null,null,null,null,null,null,null,null,null,null,null,null,null,null,null,8694,"Hács","Somogy"]
[null,null,null,null,null,null,null,null,null,null,null,null,null,null,null,null,null,null,null,null,8992,"Hagyárosbörönd","Zala"]
[null,null,null,null,null,null,null,null,null,null,null,null,null,null,null,null,null,null,null,null,8771,"Hahót","Zala"]
[null,null,null,null,null,null,null,null,null,null,null,null,null,null,null,null,null,null,null,null,4273,"Hajdúbagos","Hajdú-Bihar"]
[null,null,null,null,null,null,null,null,null,null,null,null,null,null,null,null,null,null,null,null,4224,"Hajdúböszörmény","Hajdú-Bihar"]
[null,null,null,null,null,null,null,null,null,null,null,null,null,null,null,null,null,null,null,null,4086,"Hajdúböszörmény","Hajdú-Bihar"]
[null,null,null,null,null,null,null,null,null,null,null,null,null,null,null,null,null,null,null,null,4074,"Hajdúböszörmény","Hajdú-Bihar"]
[null,null,null,null,null,null,null,null,null,null,null,null,null,null,null,null,null,null,null,null,4220,"Hajdúböszörmény","Hajdú-Bihar"]
[null,null,null,null,null,null,null,null,null,null,null,null,null,null,null,null,null,null,null,null,4087,"Hajdúdorog","Hajdú-Bihar"]
[null,null,null,null,null,null,null,null,null,null,null,null,null,null,null,null,null,null,null,null,4242,"Hajdúhadház","Hajdú-Bihar"]
[null,null,null,null,null,null,null,null,null,null,null,null,null,null,null,null,null,null,null,null,4085,"Hajdúnánás","Hajdú-Bihar"]
[null,null,null,null,null,null,null,null,null,null,null,null,null,null,null,null,null,null,null,null,4080,"Hajdúnánás","Hajdú-Bihar"]
[null,null,null,null,null,null,null,null,null,null,null,null,null,null,null,null,null,null,null,null,4251,"Hajdúsámson","Hajdú-Bihar"]
[null,null,null,null,null,null,null,null,null,null,null,null,null,null,null,null,null,null,null,null,4200,"Hajdúszoboszló","Hajdú-Bihar"]
[null,null,null,null,null,null,null,null,null,null,null,null,null,null,null,null,null,null,null,null,4212,"Hajdúszovát","Hajdú-Bihar"]
[null,null,null,null,null,null,null,null,null,null,null,null,null,null,null,null,null,null,null,null,7473,"Hajmás","Somogy"]
[null,null,null,null,null,null,null,null,null,null,null,null,null,null,null,null,null,null,null,null,8192,"Hajmáskér","Veszprém"]
[null,null,null,null,null,null,null,null,null,null,null,null,null,null,null,null,null,null,null,null,6344,"Hajós","Bács-Kiskun"]
[null,null,null,null,null,null,null,null,null,null,null,null,null,null,null,null,null,null,null,null,9814,"Halastó","Vas"]
[null,null,null,null,null,null,null,null,null,null,null,null,null,null,null,null,null,null,null,null,9228,"Halászi","Győr-Moson-Sopron"]
[null,null,null,null,null,null,null,null,null,null,null,null,null,null,null,null,null,null,null,null,2314,"Halásztelek","Pest"]
[null,null,null,null,null,null,null,null,null,null,null,null,null,null,null,null,null,null,null,null,8452,"Halimba","Veszprém"]
[null,null,null,null,null,null,null,null,null,null,null,null,null,null,null,null,null,null,null,null,3842,"Halmaj","Borsod-Abaúj-Zemplén"]
[null,null,null,null,null,null,null,null,null,null,null,null,null,null,null,null,null,null,null,null,3273,"Halmajugra","Heves"]
[null,null,null,null,null,null,null,null,null,null,null,null,null,null,null,null,null,null,null,null,9917,"Halogy","Vas"]
[null,null,null,null,null,null,null,null,null,null,null,null,null,null,null,null,null,null,null,null,3795,"Hangács","Borsod-Abaúj-Zemplén"]
[null,null,null,null,null,null,null,null,null,null,null,null,null,null,null,null,null,null,null,null,3626,"Hangony","Borsod-Abaúj-Zemplén"]
[null,null,null,null,null,null,null,null,null,null,null,null,null,null,null,null,null,null,null,null,2434,"Hantos","Fejér"]
[null,null,null,null,null,null,null,null,null,null,null,null,null,null,null,null,null,null,null,null,9784,"Harasztifalu","Vas"]
[null,null,null,null,null,null,null,null,null,null,null,null,null,null,null,null,null,null,null,null,7172,"Harc","Tolna"]
[null,null,null,null,null,null,null,null,null,null,null,null,null,null,null,null,null,null,null,null,9422,"Harka","Győr-Moson-Sopron"]
[null,null,null,null,null,null,null,null,null,null,null,null,null,null,null,null,null,null,null,null,6136,"Harkakötöny","Bács-Kiskun"]
[null,null,null,null,null,null,null,null,null,null,null,null,null,null,null,null,null,null,null,null,7815,"Harkány","Baranya"]
[null,null,null,null,null,null,null,null,null,null,null,null,null,null,null,null,null,null,null,null,7585,"Háromfa","Somogy"]
[null,null,null,null,null,null,null,null,null,null,null,null,null,null,null,null,null,null,null,null,3936,"Háromhuta","Borsod-Abaúj-Zemplén"]
[null,null,null,null,null,null,null,null,null,null,null,null,null,null,null,null,null,null,null,null,3555,"Harsány","Borsod-Abaúj-Zemplén"]
[null,null,null,null,null,null,null,null,null,null,null,null,null,null,null,null,null,null,null,null,8442,"Hárskút","Veszprém"]
[null,null,null,null,null,null,null,null,null,null,null,null,null,null,null,null,null,null,null,null,6327,"Harta","Bács-Kiskun"]
[null,null,null,null,null,null,null,null,null,null,null,null,null,null,null,null,null,null,null,null,6326,"Harta","Bács-Kiskun"]
[null,null,null,null,null,null,null,null,null,null,null,null,null,null,null,null,null,null,null,null,7745,"Hásságy","Baranya"]
[null,null,null,null,null,null,null,null,null,null,null,null,null,null,null,null,null,null,null,null,3000,"Hatvan","Heves"]
[null,null,null,null,null,null,null,null,null,null,null,null,null,null,null,null,null,null,null,null,9178,"Hédervár","Győr-Moson-Sopron"]
[null,null,null,null,null,null,null,null,null,null,null,null,null,null,null,null,null,null,null,null,7533,"Hedrehely","Somogy"]
[null,null,null,null,null,null,null,null,null,null,null,null,null,null,null,null,null,null,null,null,8296,"Hegyesd","Veszprém"]
[null,null,null,null,null,null,null,null,null,null,null,null,null,null,null,null,null,null,null,null,9222,"Hegyeshalom","Győr-Moson-Sopron"]
[null,null,null,null,null,null,null,null,null,null,null,null,null,null,null,null,null,null,null,null,9631,"Hegyfalu","Vas"]
[null,null,null,null,null,null,null,null,null,null,null,null,null,null,null,null,null,null,null,null,9915,"Hegyháthodász","Vas"]
[null,null,null,null,null,null,null,null,null,null,null,null,null,null,null,null,null,null,null,null,7348,"Hegyhátmaróc","Baranya"]
[null,null,null,null,null,null,null,null,null,null,null,null,null,null,null,null,null,null,null,null,9915,"Hegyhátsál","Vas"]
[null,null,null,null,null,null,null,null,null,null,null,null,null,null,null,null,null,null,null,null,9934,"Hegyhátszentjakab","Vas"]
[null,null,null,null,null,null,null,null,null,null,null,null,null,null,null,null,null,null,null,null,9931,"Hegyhátszentmárton","Vas"]
[null,null,null,null,null,null,null,null,null,null,null,null,null,null,null,null,null,null,null,null,9826,"Hegyhátszentpéter","Vas"]
[null,null,null,null,null,null,null,null,null,null,null,null,null,null,null,null,null,null,null,null,9437,"Hegykő","Győr-Moson-Sopron"]
[null,null,null,null,null,null,null,null,null,null,null,null,null,null,null,null,null,null,null,null,8265,"Hegymagas","Veszprém"]
[null,null,null,null,null,null,null,null,null,null,null,null,null,null,null,null,null,null,null,null,3786,"Hegymeg","Borsod-Abaúj-Zemplén"]
[null,null,null,null,null,null,null,null,null,null,null,null,null,null,null,null,null,null,null,null,7837,"Hegyszentmárton","Baranya"]
[null,null,null,null,null,null,null,null,null,null,null,null,null,null,null,null,null,null,null,null,3041,"Héhalom","Nógrád"]
[null,null,null,null,null,null,null,null,null,null,null,null,null,null,null,null,null,null,null,null,3892,"Hejce","Borsod-Abaúj-Zemplén"]
[null,null,null,null,null,null,null,null,null,null,null,null,null,null,null,null,null,null,null,null,3593,"Hejőbába","Borsod-Abaúj-Zemplén"]
[null,null,null,null,null,null,null,null,null,null,null,null,null,null,null,null,null,null,null,null,3597,"Hejőkeresztúr","Borsod-Abaúj-Zemplén"]
[null,null,null,null,null,null,null,null,null,null,null,null,null,null,null,null,null,null,null,null,3588,"Hejőkürt","Borsod-Abaúj-Zemplén"]
[null,null,null,null,null,null,null,null,null,null,null,null,null,null,null,null,null,null,null,null,3594,"Hejőpapi","Borsod-Abaúj-Zemplén"]
[null,null,null,null,null,null,null,null,null,null,null,null,null,null,null,null,null,null,null,null,3595,"Hejőszalonta","Borsod-Abaúj-Zemplén"]
[null,null,null,null,null,null,null,null,null,null,null,null,null,null,null,null,null,null,null,null,7683,"Helesfa","Baranya"]
[null,null,null,null,null,null,null,null,null,null,null,null,null,null,null,null,null,null,null,null,6034,"Helvécia","Bács-Kiskun"]
[null,null,null,null,null,null,null,null,null,null,null,null,null,null,null,null,null,null,null,null,4123,"Hencida","Hajdú-Bihar"]
[null,null,null,null,null,null,null,null,null,null,null,null,null,null,null,null,null,null,null,null,7532,"Hencse","Somogy"]
[null,null,null,null,null,null,null,null,null,null,null,null,null,null,null,null,null,null,null,null,2053,"Herceghalom","Pest"]
[null,null,null,null,null,null,null,null,null,null,null,null,null,null,null,null,null,null,null,null,3958,"Hercegkút","Borsod-Abaúj-Zemplén"]
[null,null,null,null,null,null,null,null,null,null,null,null,null,null,null,null,null,null,null,null,6525,"Hercegszántó","Bács-Kiskun"]
[null,null,null,null,null,null,null,null,null,null,null,null,null,null,null,null,null,null,null,null,3011,"Heréd","Heves"]
[null,null,null,null,null,null,null,null,null,null,null,null,null,null,null,null,null,null,null,null,2832,"Héreg","Komárom-Esztergom"]
[null,null,null,null,null,null,null,null,null,null,null,null,null,null,null,null,null,null,null,null,2677,"Herencsény","Nógrád"]
[null,null,null,null,null,null,null,null,null,null,null,null,null,null,null,null,null,null,null,null,8440,"Herend","Veszprém"]
[null,null,null,null,null,null,null,null,null,null,null,null,null,null,null,null,null,null,null,null,7587,"Heresznye","Somogy"]
[null,null,null,null,null,null,null,null,null,null,null,null,null,null,null,null,null,null,null,null,4735,"Hermánszeg","Szabolcs-Szatmár-Bereg"]
[null,null,null,null,null,null,null,null,null,null,null,null,null,null,null,null,null,null,null,null,2376,"Hernád","Pest"]
[null,null,null,null,null,null,null,null,null,null,null,null,null,null,null,null,null,null,null,null,3853,"Hernádbűd","Borsod-Abaúj-Zemplén"]
[null,null,null,null,null,null,null,null,null,null,null,null,null,null,null,null,null,null,null,null,3887,"Hernádcéce","Borsod-Abaúj-Zemplén"]
[null,null,null,null,null,null,null,null,null,null,null,null,null,null,null,null,null,null,null,null,3563,"Hernádkak","Borsod-Abaúj-Zemplén"]
[null,null,null,null,null,null,null,null,null,null,null,null,null,null,null,null,null,null,null,null,3846,"Hernádkércs","Borsod-Abaúj-Zemplén"]
[null,null,null,null,null,null,null,null,null,null,null,null,null,null,null,null,null,null,null,null,3564,"Hernádnémeti","Borsod-Abaúj-Zemplén"]
[null,null,null,null,null,null,null,null,null,null,null,null,null,null,null,null,null,null,null,null,3874,"Hernádpetri","Borsod-Abaúj-Zemplén"]
[null,null,null,null,null,null,null,null,null,null,null,null,null,null,null,null,null,null,null,null,3852,"Hernádszentandrás","Borsod-Abaúj-Zemplén"]
[null,null,null,null,null,null,null,null,null,null,null,null,null,null,null,null,null,null,null,null,3875,"Hernádszurdok","Borsod-Abaúj-Zemplén"]
[null,null,null,null,null,null,null,null,null,null,null,null,null,null,null,null,null,null,null,null,3874,"Hernádvécse","Borsod-Abaúj-Zemplén"]
[null,null,null,null,null,null,null,null,null,null,null,null,null,null,null,null,null,null,null,null,8957,"Hernyék","Zala"]
[null,null,null,null,null,null,null,null,null,null,null,null,null,null,null,null,null,null,null,null,3655,"Hét","Borsod-Abaúj-Zemplén"]
[null,null,null,null,null,null,null,null,null,null,null,null,null,null,null,null,null,null,null,null,4843,"Hetefejércse","Szabolcs-Szatmár-Bereg"]
[null,null,null,null,null,null,null,null,null,null,null,null,null,null,null,null,null,null,null,null,7432,"Hetes","Somogy"]
[null,null,null,null,null,null,null,null,null,null,null,null,null,null,null,null,null,null,null,null,7681,"Hetvehely","Baranya"]
[null,null,null,null,null,null,null,null,null,null,null,null,null,null,null,null,null,null,null,null,8344,"Hetyefő","Veszprém"]
[null,null,null,null,null,null,null,null,null,null,null,null,null,null,null,null,null,null,null,null,3360,"Heves","Heves"]
[null,null,null,null,null,null,null,null,null,null,null,null,null,null,null,null,null,null,null,null,3322,"Hevesaranyos","Heves"]
[null,null,null,null,null,null,null,null,null,null,null,null,null,null,null,null,null,null,null,null,3383,"Hevesvezekény","Heves"]
[null,null,null,null,null,null,null,null,null,null,null,null,null,null,null,null,null,null,null,null,8380,"Hévíz","Zala"]
[null,null,null,null,null,null,null,null,null,null,null,null,null,null,null,null,null,null,null,null,2192,"Hévízgyörk","Pest"]
[null,null,null,null,null,null,null,null,null,null,null,null,null,null,null,null,null,null,null,null,7696,"Hidas","Baranya"]
[null,null,null,null,null,null,null,null,null,null,null,null,null,null,null,null,null,null,null,null,3876,"Hidasnémeti","Borsod-Abaúj-Zemplén"]
[null,null,null,null,null,null,null,null,null,null,null,null,null,null,null,null,null,null,null,null,8247,"Hidegkút","Veszprém"]
[null,null,null,null,null,null,null,null,null,null,null,null,null,null,null,null,null,null,null,null,9491,"Hidegség","Győr-Moson-Sopron"]
[null,null,null,null,null,null,null,null,null,null,null,null,null,null,null,null,null,null,null,null,3768,"Hidvégardó","Borsod-Abaúj-Zemplén"]
[null,null,null,null,null,null,null,null,null,null,null,null,null,null,null,null,null,null,null,null,7735,"Himesháza","Baranya"]
[null,null,null,null,null,null,null,null,null,null,null,null,null,null,null,null,null,null,null,null,9362,"Himod","Győr-Moson-Sopron"]
[null,null,null,null,null,null,null,null,null,null,null,null,null,null,null,null,null,null,null,null,7838,"Hirics","Baranya"]
[null,null,null,null,null,null,null,null,null,null,null,null,null,null,null,null,null,null,null,null,7971,"Hobol","Baranya"]
[null,null,null,null,null,null,null,null,null,null,null,null,null,null,null,null,null,null,null,null,4334,"Hodász","Szabolcs-Szatmár-Bereg"]
[null,null,null,null,null,null,null,null,null,null,null,null,null,null,null,null,null,null,null,null,6806,"Hódmezővásárhely","Csongrád"]
[null,null,null,null,null,null,null,null,null,null,null,null,null,null,null,null,null,null,null,null,6800,"Hódmezővásárhely","Csongrád"]
[null,null,null,null,null,null,null,null,null,null,null,null,null,null,null,null,null,null,null,null,7191,"Hőgyész","Somogy"]
[null,null,null,null,null,null,null,null,null,null,null,null,null,null,null,null,null,null,null,null,8731,"Hollád","Borsod-Abaúj-Zemplén"]
[null,null,null,null,null,null,null,null,null,null,null,null,null,null,null,null,null,null,null,null,3999,"Hollóháza","Nógrád"]
[null,null,null,null,null,null,null,null,null,null,null,null,null,null,null,null,null,null,null,null,3176,"Hollókő","Veszprém"]
[null,null,null,null,null,null,null,null,null,null,null,null,null,null,null,null,null,null,null,null,8563,"Homokbödöge","Zala"]
[null,null,null,null,null,null,null,null,null,null,null,null,null,null,null,null,null,null,null,null,8777,"Homokkomárom","Bács-Kiskun"]
[null,null,null,null,null,null,null,null,null,null,null,null,null,null,null,null,null,null,null,null,6341,"Homokmégy","Somogy"]
[null,null,null,null,null,null,null,null,null,null,null,null,null,null,null,null,null,null,null,null,7537,"Homokszentgyörgy","Baranya"]
[null,null,null,null,null,null,null,null,null,null,null,null,null,null,null,null,null,null,null,null,7716,"Homorúd","Borsod-Abaúj-Zemplén"]
[null,null,null,null,null,null,null,null,null,null,null,null,null,null,null,null,null,null,null,null,3812,"Homrogd","Nógrád"]
[null,null,null,null,null,null,null,null,null,null,null,null,null,null,null,null,null,null,null,null,2647,"Hont","Nógrád"]
[null,null,null,null,null,null,null,null,null,null,null,null,null,null,null,null,null,null,null,null,2658,"Horpács","Heves"]
[null,null,null,null,null,null,null,null,null,null,null,null,null,null,null,null,null,null,null,null,3014,"Hort","Hajdú-Bihar"]
[null,null,null,null,null,null,null,null,null,null,null,null,null,null,null,null,null,null,null,null,4071,"Hortobágy","Baranya"]
[null,null,null,null,null,null,null,null,null,null,null,null,null,null,null,null,null,null,null,null,7935,"Horváthertelend","Vas"]
[null,null,null,null,null,null,null,null,null,null,null,null,null,null,null,null,null,null,null,null,9796,"Horvátlövő","Vas"]
[null,null,null,null,null,null,null,null,null,null,null,null,null,null,null,null,null,null,null,null,9733,"Horvátzsidány","Baranya"]
[null,null,null,null,null,null,null,null,null,null,null,null,null,null,null,null,null,null,null,null,7694,"Hosszúhetény","Hajdú-Bihar"]
[null,null,null,null,null,null,null,null,null,null,null,null,null,null,null,null,null,null,null,null,4274,"Hosszúpályi","Vas"]
[null,null,null,null,null,null,null,null,null,null,null,null,null,null,null,null,null,null,null,null,9676,"Hosszúpereszteg","Somogy"]
[null,null,null,null,null,null,null,null,null,null,null,null,null,null,null,null,null,null,null,null,8716,"Hosszúvíz","Zala"]
[null,null,null,null,null,null,null,null,null,null,null,null,null,null,null,null,null,null,null,null,8777,"Hosszúvölgy","Veszprém"]
[null,null,null,null,null,null,null,null,null,null,null,null,null,null,null,null,null,null,null,null,8475,"Hosztót","Zala"]
[null,null,null,null,null,null,null,null,null,null,null,null,null,null,null,null,null,null,null,null,8991,"Hottó","Tolna"]
[null,null,null,null,null,null,null,null,null,null,null,null,null,null,null,null,null,null,null,null,9361,"Hövej","Győr-Moson-Sopron"]
[null,null,null,null,null,null,null,null,null,null,null,null,null,null,null,null,null,null,null,null,2672,"Hugyag","Nógrád"]
[null,null,null,null,null,null,null,null,null,null,null,null,null,null,null,null,null,null,null,null,5555,"Hunya","Békés"]
[null,null,null,null,null,null,null,null,null,null,null,null,null,null,null,null,null,null,null,null,5063,"Hunyadfalva","Jász-Nagykun-Szolnok"]
[null,null,null,null,null,null,null,null,null,null,null,null,null,null,null,null,null,null,null,null,7678,"Husztót","Baranya"]
[null,null,null,null,null,null,null,null,null,null,null,null,null,null,null,null,null,null,null,null,7935,"Ibafa","Baranya"]
[null,null,null,null,null,null,null,null,null,null,null,null,null,null,null,null,null,null,null,null,8984,"Iborfia","Zala"]
[null,null,null,null,null,null,null,null,null,null,null,null,null,null,null,null,null,null,null,null,4484,"Ibrány","Szabolcs-Szatmár-Bereg"]
[null,null,null,null,null,null,null,null,null,null,null,null,null,null,null,null,null,null,null,null,7275,"Igal","Somogy"]
[null,null,null,null,null,null,null,null,null,null,null,null,null,null,null,null,null,null,null,null,7016,"Igar","Fejér"]
[null,null,null,null,null,null,null,null,null,null,null,null,null,null,null,null,null,null,null,null,7015,"Igar","Fejér"]
[null,null,null,null,null,null,null,null,null,null,null,null,null,null,null,null,null,null,null,null,3459,"Igrici","Borsod-Abaúj-Zemplén"]
[null,null,null,null,null,null,null,null,null,null,null,null,null,null,null,null,null,null,null,null,8726,"Iharos","Somogy"]
[null,null,null,null,null,null,null,null,null,null,null,null,null,null,null,null,null,null,null,null,8725,"Iharosberény","Somogy"]
[null,null,null,null,null,null,null,null,null,null,null,null,null,null,null,null,null,null,null,null,9756,"Ikervár","Vas"]
[null,null,null,null,null,null,null,null,null,null,null,null,null,null,null,null,null,null,null,null,2181,"Iklad","Pest"]
[null,null,null,null,null,null,null,null,null,null,null,null,null,null,null,null,null,null,null,null,9634,"Iklanberény","Vas"]
[null,null,null,null,null,null,null,null,null,null,null,null,null,null,null,null,null,null,null,null,8958,"Iklódbördőce","Zala"]
[null,null,null,null,null,null,null,null,null,null,null,null,null,null,null,null,null,null,null,null,9141,"Ikrény","Győr-Moson-Sopron"]
[null,null,null,null,null,null,null,null,null,null,null,null,null,null,null,null,null,null,null,null,2675,"Iliny","Nógrád"]
[null,null,null,null,null,null,null,null,null,null,null,null,null,null,null,null,null,null,null,null,4566,"Ilk","Szabolcs-Szatmár-Bereg"]
[null,null,null,null,null,null,null,null,null,null,null,null,null,null,null,null,null,null,null,null,7775,"Illocska","Baranya"]
[null,null,null,null,null,null,null,null,null,null,null,null,null,null,null,null,null,null,null,null,3724,"Imola","Borsod-Abaúj-Zemplén"]
[null,null,null,null,null,null,null,null,null,null,null,null,null,null,null,null,null,null,null,null,6238,"Imrehegy","Bács-Kiskun"]
[null,null,null,null,null,null,null,null,null,null,null,null,null,null,null,null,null,null,null,null,3851,"Ináncs","Borsod-Abaúj-Zemplén"]
[null,null,null,null,null,null,null,null,null,null,null,null,null,null,null,null,null,null,null,null,2365,"Inárcs","Pest"]
[null,null,null,null,null,null,null,null,null,null,null,null,null,null,null,null,null,null,null,null,8724,"Inke","Somogy"]
[null,null,null,null,null,null,null,null,null,null,null,null,null,null,null,null,null,null,null,null,7847,"Ipacsfa","Baranya"]
[null,null,null,null,null,null,null,null,null,null,null,null,null,null,null,null,null,null,null,null,2631,"Ipolydamásd","Pest"]
[null,null,null,null,null,null,null,null,null,null,null,null,null,null,null,null,null,null,null,null,3138,"Ipolytarnóc","Nógrád"]
[null,null,null,null,null,null,null,null,null,null,null,null,null,null,null,null,null,null,null,null,2633,"Ipolytölgyes","Pest"]
[null,null,null,null,null,null,null,null,null,null,null,null,null,null,null,null,null,null,null,null,2669,"Ipolyvece","Nógrád"]
[null,null,null,null,null,null,null,null,null,null,null,null,null,null,null,null,null,null,null,null,7095,"Iregszemcse","Tolna"]
[null,null,null,null,null,null,null,null,null,null,null,null,null,null,null,null,null,null,null,null,3786,"Irota","Borsod-Abaúj-Zemplén"]
[null,null,null,null,null,null,null,null,null,null,null,null,null,null,null,null,null,null,null,null,2117,"Isaszeg","Pest"]
[null,null,null,null,null,null,null,null,null,null,null,null,null,null,null,null,null,null,null,null,9941,"Ispánk","Vas"]
[null,null,null,null,null,null,null,null,null,null,null,null,null,null,null,null,null,null,null,null,3253,"Istenmezeje","Heves"]
[null,null,null,null,null,null,null,null,null,null,null,null,null,null,null,null,null,null,null,null,7987,"Istvándi","Somogy"]
[null,null,null,null,null,null,null,null,null,null,null,null,null,null,null,null,null,null,null,null,8043,"Iszkaszentgyörgy","Fejér"]
[null,null,null,null,null,null,null,null,null,null,null,null,null,null,null,null,null,null,null,null,8493,"Iszkáz","Veszprém"]
[null,null,null,null,null,null,null,null,null,null,null,null,null,null,null,null,null,null,null,null,8045,"Isztimér","Fejér"]
[null,null,null,null,null,null,null,null,null,null,null,null,null,null,null,null,null,null,null,null,3248,"Ivád","Heves"]
[null,null,null,null,null,null,null,null,null,null,null,null,null,null,null,null,null,null,null,null,9374,"Iván","Győr-Moson-Sopron"]
[null,null,null,null,null,null,null,null,null,null,null,null,null,null,null,null,null,null,null,null,7772,"Ivánbattyán","Baranya"]
[null,null,null,null,null,null,null,null,null,null,null,null,null,null,null,null,null,null,null,null,9931,"Ivánc","Vas"]
[null,null,null,null,null,null,null,null,null,null,null,null,null,null,null,null,null,null,null,null,2454,"Iváncsa","Fejér"]
[null,null,null,null,null,null,null,null,null,null,null,null,null,null,null,null,null,null,null,null,7781,"Ivándárda","Baranya"]
[null,null,null,null,null,null,null,null,null,null,null,null,null,null,null,null,null,null,null,null,7353,"Izmény","Tolna"]
[null,null,null,null,null,null,null,null,null,null,null,null,null,null,null,null,null,null,null,null,6070,"Izsák","Bács-Kiskun"]
[null,null,null,null,null,null,null,null,null,null,null,null,null,null,null,null,null,null,null,null,3741,"Izsófalva","Borsod-Abaúj-Zemplén"]
[null,null,null,null,null,null,null,null,null,null,null,null,null,null,null,null,null,null,null,null,7362,"Jágónak","Tolna"]
[null,null,null,null,null,null,null,null,null,null,null,null,null,null,null,null,null,null,null,null,9798,"Ják","Vas"]
[null,null,null,null,null,null,null,null,null,null,null,null,null,null,null,null,null,null,null,null,6078,"Jakabszállás","Bács-Kiskun"]
[null,null,null,null,null,null,null,null,null,null,null,null,null,null,null,null,null,null,null,null,9643,"Jákfa","Vas"]
[null,null,null,null,null,null,null,null,null,null,null,null,null,null,null,null,null,null,null,null,3721,"Jákfalva","Borsod-Abaúj-Zemplén"]
[null,null,null,null,null,null,null,null,null,null,null,null,null,null,null,null,null,null,null,null,7525,"Jákó","Somogy"]
[null,null,null,null,null,null,null,null,null,null,null,null,null,null,null,null,null,null,null,null,4841,"Jánd","Szabolcs-Szatmár-Bereg"]
[null,null,null,null,null,null,null,null,null,null,null,null,null,null,null,null,null,null,null,null,4741,"Jánkmajtis","Szabolcs-Szatmár-Bereg"]
[null,null,null,null,null,null,null,null,null,null,null,null,null,null,null,null,null,null,null,null,6440,"Jánoshalma","Bács-Kiskun"]
[null,null,null,null,null,null,null,null,null,null,null,null,null,null,null,null,null,null,null,null,9545,"Jánosháza","Vas"]
[null,null,null,null,null,null,null,null,null,null,null,null,null,null,null,null,null,null,null,null,5143,"Jánoshida","Jász-Nagykun-Szolnok"]
[null,null,null,null,null,null,null,null,null,null,null,null,null,null,null,null,null,null,null,null,9241,"Jánossomorja","Győr-Moson-Sopron"]
[null,null,null,null,null,null,null,null,null,null,null,null,null,null,null,null,null,null,null,null,9242,"Jánossomorja","Győr-Moson-Sopron"]
[null,null,null,null,null,null,null,null,null,null,null,null,null,null,null,null,null,null,null,null,3664,"Járdánháza","Borsod-Abaúj-Zemplén"]
[null,null,null,null,null,null,null,null,null,null,null,null,null,null,null,null,null,null,null,null,4337,"Jármi","Szabolcs-Szatmár-Bereg"]
[null,null,null,null,null,null,null,null,null,null,null,null,null,null,null,null,null,null,null,null,8424,"Jásd","Veszprém"]
[null,null,null,null,null,null,null,null,null,null,null,null,null,null,null,null,null,null,null,null,5124,"Jászágó","Jász-Nagykun-Szolnok"]
[null,null,null,null,null,null,null,null,null,null,null,null,null,null,null,null,null,null,null,null,5054,"Jászalsószentgyörgy","Jász-Nagykun-Szolnok"]
[null,null,null,null,null,null,null,null,null,null,null,null,null,null,null,null,null,null,null,null,5130,"Jászapáti","Jász-Nagykun-Szolnok"]
[null,null,null,null,null,null,null,null,null,null,null,null,null,null,null,null,null,null,null,null,5123,"Jászárokszállás","Jász-Nagykun-Szolnok"]
[null,null,null,null,null,null,null,null,null,null,null,null,null,null,null,null,null,null,null,null,5152,"Jászberény","Jász-Nagykun-Szolnok"]
[null,null,null,null,null,null,null,null,null,null,null,null,null,null,null,null,null,null,null,null,5100,"Jászberény","Jász-Nagykun-Szolnok"]
[null,null,null,null,null,null,null,null,null,null,null,null,null,null,null,null,null,null,null,null,5144,"Jászboldogháza","Jász-Nagykun-Szolnok"]
[null,null,null,null,null,null,null,null,null,null,null,null,null,null,null,null,null,null,null,null,5122,"Jászdózsa","Jász-Nagykun-Szolnok"]
[null,null,null,null,null,null,null,null,null,null,null,null,null,null,null,null,null,null,null,null,5111,"Jászfelsőszentgyörgy","Jász-Nagykun-Szolnok"]
[null,null,null,null,null,null,null,null,null,null,null,null,null,null,null,null,null,null,null,null,5126,"Jászfényszaru","Jász-Nagykun-Szolnok"]
[null,null,null,null,null,null,null,null,null,null,null,null,null,null,null,null,null,null,null,null,5135,"Jászivány","Jász-Nagykun-Szolnok"]
[null,null,null,null,null,null,null,null,null,null,null,null,null,null,null,null,null,null,null,null,5121,"Jászjákóhalma","Jász-Nagykun-Szolnok"]
[null,null,null,null,null,null,null,null,null,null,null,null,null,null,null,null,null,null,null,null,2746,"Jászkarajenő","Pest"]
[null,null,null,null,null,null,null,null,null,null,null,null,null,null,null,null,null,null,null,null,5137,"Jászkisér","Jász-Nagykun-Szolnok"]
[null,null,null,null,null,null,null,null,null,null,null,null,null,null,null,null,null,null,null,null,5055,"Jászladány","Jász-Nagykun-Szolnok"]
[null,null,null,null,null,null,null,null,null,null,null,null,null,null,null,null,null,null,null,null,5136,"Jászszentandrás","Jász-Nagykun-Szolnok"]
[null,null,null,null,null,null,null,null,null,null,null,null,null,null,null,null,null,null,null,null,6133,"Jászszentlászló","Bács-Kiskun"]
[null,null,null,null,null,null,null,null,null,null,null,null,null,null,null,null,null,null,null,null,5141,"Jásztelek","Jász-Nagykun-Szolnok"]
[null,null,null,null,null,null,null,null,null,null,null,null,null,null,null,null,null,null,null,null,4611,"Jéke","Szabolcs-Szatmár-Bereg"]
[null,null,null,null,null,null,null,null,null,null,null,null,null,null,null,null,null,null,null,null,8146,"Jenő","Fejér"]
[null,null,null,null,null,null,null,null,null,null,null,null,null,null,null,null,null,null,null,null,9323,"Jobaháza","Győr-Moson-Sopron"]
[null,null,null,null,null,null,null,null,null,null,null,null,null,null,null,null,null,null,null,null,3063,"Jobbágyi","Nógrád"]
[null,null,null,null,null,null,null,null,null,null,null,null,null,null,null,null,null,null,null,null,3758,"Jósvafő","Borsod-Abaúj-Zemplén"]
[null,null,null,null,null,null,null,null,null,null,null,null,null,null,null,null,null,null,null,null,7431,"Juta","Somogy"]
[null,null,null,null,null,null,null,null,null,null,null,null,null,null,null,null,null,null,null,null,4183,"Kaba","Hajdú-Bihar"]
[null,null,null,null,null,null,null,null,null,null,null,null,null,null,null,null,null,null,null,null,8773,"Kacorlak","Zala"]
[null,null,null,null,null,null,null,null,null,null,null,null,null,null,null,null,null,null,null,null,3424,"Kács","Borsod-Abaúj-Zemplén"]
[null,null,null,null,null,null,null,null,null,null,null,null,null,null,null,null,null,null,null,null,7940,"Kacsóta","Baranya"]
[null,null,null,null,null,null,null,null,null,null,null,null,null,null,null,null,null,null,null,null,7530,"Kadarkút","Somogy"]
[null,null,null,null,null,null,null,null,null,null,null,null,null,null,null,null,null,null,null,null,9123,"Kajárpéc","Győr-Moson-Sopron"]
[null,null,null,null,null,null,null,null,null,null,null,null,null,null,null,null,null,null,null,null,2472,"Kajászó","Fejér"]
[null,null,null,null,null,null,null,null,null,null,null,null,null,null,null,null,null,null,null,null,7051,"Kajdacs","Tolna"]
[null,null,null,null,null,null,null,null,null,null,null,null,null,null,null,null,null,null,null,null,7122,"Kakasd","Tolna"]
[null,null,null,null,null,null,null,null,null,null,null,null,null,null,null,null,null,null,null,null,7958,"Kákics","Baranya"]
[null,null,null,null,null,null,null,null,null,null,null,null,null,null,null,null,null,null,null,null,2366,"Kakucs","Pest"]
[null,null,null,null,null,null,null,null,null,null,null,null,null,null,null,null,null,null,null,null,3350,"Kál","Heves"]
[null,null,null,null,null,null,null,null,null,null,null,null,null,null,null,null,null,null,null,null,7194,"Kalaznó","Tolna"]
[null,null,null,null,null,null,null,null,null,null,null,null,null,null,null,null,null,null,null,null,9673,"Káld","Vas"]
[null,null,null,null,null,null,null,null,null,null,null,null,null,null,null,null,null,null,null,null,2175,"Kálló","Nógrád"]
[null,null,null,null,null,null,null,null,null,null,null,null,null,null,null,null,null,null,null,null,8785,"Kallósd","Zala"]
[null,null,null,null,null,null,null,null,null,null,null,null,null,null,null,null,null,null,null,null,4324,"Kállósemjén","Szabolcs-Szatmár-Bereg"]
[null,null,null,null,null,null,null,null,null,null,null,null,null,null,null,null,null,null,null,null,7538,"Kálmáncsa","Somogy"]
[null,null,null,null,null,null,null,null,null,null,null,null,null,null,null,null,null,null,null,null,4434,"Kálmánháza","Szabolcs-Szatmár-Bereg"]
[null,null,null,null,null,null,null,null,null,null,null,null,null,null,null,null,null,null,null,null,8988,"Kálócfa","Zala"]
[null,null,null,null,null,null,null,null,null,null,null,null,null,null,null,null,null,null,null,null,6300,"Kalocsa","Bács-Kiskun"]
[null,null,null,null,null,null,null,null,null,null,null,null,null,null,null,null,null,null,null,null,8124,"Káloz","Fejér"]
[null,null,null,null,null,null,null,null,null,null,null,null,null,null,null,null,null,null,null,null,9841,"Kám","Vas"]
[null,null,null,null,null,null,null,null,null,null,null,null,null,null,null,null,null,null,null,null,8469,"Kamond","Veszprém"]
[null,null,null,null,null,null,null,null,null,null,null,null,null,null,null,null,null,null,null,null,5673,"Kamut","Békés"]
[null,null,null,null,null,null,null,null,null,null,null,null,null,null,null,null,null,null,null,null,3735,"Kánó","Borsod-Abaúj-Zemplén"]
[null,null,null,null,null,null,null,null,null,null,null,null,null,null,null,null,null,null,null,null,4335,"Kántorjánosi","Szabolcs-Szatmár-Bereg"]
[null,null,null,null,null,null,null,null,null,null,null,null,null,null,null,null,null,null,null,null,3821,"Kány","Borsod-Abaúj-Zemplén"]
[null,null,null,null,null,null,null,null,null,null,null,null,null,null,null,null,null,null,null,null,8667,"Kánya","Somogy"]
[null,null,null,null,null,null,null,null,null,null,null,null,null,null,null,null,null,null,null,null,8956,"Kányavár","Zala"]
[null,null,null,null,null,null,null,null,null,null,null,null,null,null,null,null,null,null,null,null,8294,"Kapolcs","Veszprém"]
[null,null,null,null,null,null,null,null,null,null,null,null,null,null,null,null,null,null,null,null,3355,"Kápolna","Heves"]
[null,null,null,null,null,null,null,null,null,null,null,null,null,null,null,null,null,null,null,null,2475,"Kápolnásnyék","Fejér"]
[null,null,null,null,null,null,null,null,null,null,null,null,null,null,null,null,null,null,null,null,8671,"Kapoly","Somogy"]
[null,null,null,null,null,null,null,null,null,null,null,null,null,null,null,null,null,null,null,null,7523,"Kaposfő","Somogy"]
[null,null,null,null,null,null,null,null,null,null,null,null,null,null,null,null,null,null,null,null,7473,"Kaposgyarmat","Somogy"]
[null,null,null,null,null,null,null,null,null,null,null,null,null,null,null,null,null,null,null,null,7261,"Kaposhomok","Somogy"]
[null,null,null,null,null,null,null,null,null,null,null,null,null,null,null,null,null,null,null,null,7258,"Kaposkeresztúr","Somogy"]
[null,null,null,null,null,null,null,null,null,null,null,null,null,null,null,null,null,null,null,null,7521,"Kaposmérő","Somogy"]
[null,null,null,null,null,null,null,null,null,null,null,null,null,null,null,null,null,null,null,null,7251,"Kapospula","Tolna"]
[null,null,null,null,null,null,null,null,null,null,null,null,null,null,null,null,null,null,null,null,7361,"Kaposszekcső","Tolna"]
[null,null,null,null,null,null,null,null,null,null,null,null,null,null,null,null,null,null,null,null,7476,"Kaposszerdahely","Somogy"]
[null,null,null,null,null,null,null,null,null,null,null,null,null,null,null,null,null,null,null,null,7522,"Kaposújlak","Somogy"]
[null,null,null,null,null,null,null,null,null,null,null,null,null,null,null,null,null,null,null,null,7400,"Kaposvár","Somogy"]
[null,null,null,null,null,null,null,null,null,null,null,null,null,null,null,null,null,null,null,null,8471,"Káptalanfa","Veszprém"]
[null,null,null,null,null,null,null,null,null,null,null,null,null,null,null,null,null,null,null,null,8283,"Káptalantóti","Veszprém"]
[null,null,null,null,null,null,null,null,null,null,null,null,null,null,null,null,null,null,null,null,9339,"Kapuvár","Győr-Moson-Sopron"]
[null,null,null,null,null,null,null,null,null,null,null,null,null,null,null,null,null,null,null,null,9330,"Kapuvár","Győr-Moson-Sopron"]
[null,null,null,null,null,null,null,null,null,null,null,null,null,null,null,null,null,null,null,null,7285,"Kára","Somogy"]
[null,null,null,null,null,null,null,null,null,null,null,null,null,null,null,null,null,null,null,null,3281,"Karácsond","Heves"]
[null,null,null,null,null,null,null,null,null,null,null,null,null,null,null,null,null,null,null,null,8676,"Karád","Somogy"]
[null,null,null,null,null,null,null,null,null,null,null,null,null,null,null,null,null,null,null,null,9547,"Karakó","Vas"]
[null,null,null,null,null,null,null,null,null,null,null,null,null,null,null,null,null,null,null,null,8491,"Karakószörcsök","Veszprém"]
[null,null,null,null,null,null,null,null,null,null,null,null,null,null,null,null,null,null,null,null,3181,"Karancsalja","Nógrád"]
[null,null,null,null,null,null,null,null,null,null,null,null,null,null,null,null,null,null,null,null,3137,"Karancsberény","Nógrád"]
[null,null,null,null,null,null,null,null,null,null,null,null,null,null,null,null,null,null,null,null,3183,"Karancskeszi","Nógrád"]
[null,null,null,null,null,null,null,null,null,null,null,null,null,null,null,null,null,null,null,null,3182,"Karancslapujtő","Nógrád"]
[null,null,null,null,null,null,null,null,null,null,null,null,null,null,null,null,null,null,null,null,3163,"Karancsság","Nógrád"]
[null,null,null,null,null,null,null,null,null,null,null,null,null,null,null,null,null,null,null,null,7333,"Kárász","Baranya"]
[null,null,null,null,null,null,null,null,null,null,null,null,null,null,null,null,null,null,null,null,5300,"Karcag","Jász-Nagykun-Szolnok"]
[null,null,null,null,null,null,null,null,null,null,null,null,null,null,null,null,null,null,null,null,3963,"Karcsa","Borsod-Abaúj-Zemplén"]
[null,null,null,null,null,null,null,null,null,null,null,null,null,null,null,null,null,null,null,null,5552,"Kardos","Békés"]
[null,null,null,null,null,null,null,null,null,null,null,null,null,null,null,null,null,null,null,null,5945,"Kardoskút","Békés"]
[null,null,null,null,null,null,null,null,null,null,null,null,null,null,null,null,null,null,null,null,8354,"Karmacs","Zala"]
[null,null,null,null,null,null,null,null,null,null,null,null,null,null,null,null,null,null,null,null,3962,"Karos","Borsod-Abaúj-Zemplén"]
[null,null,null,null,null,null,null,null,null,null,null,null,null,null,null,null,null,null,null,null,2173,"Kartal","Pest"]
[null,null,null,null,null,null,null,null,null,null,null,null,null,null,null,null,null,null,null,null,7827,"Kásád","Baranya"]
[null,null,null,null,null,null,null,null,null,null,null,null,null,null,null,null,null,null,null,null,6211,"Kaskantyú","Bács-Kiskun"]
[null,null,null,null,null,null,null,null,null,null,null,null,null,null,null,null,null,null,null,null,7977,"Kastélyosdombó","Somogy"]
[null,null,null,null,null,null,null,null,null,null,null,null,null,null,null,null,null,null,null,null,5948,"Kaszaper","Békés"]
[null,null,null,null,null,null,null,null,null,null,null,null,null,null,null,null,null,null,null,null,7564,"Kaszó","Somogy"]
[null,null,null,null,null,null,null,null,null,null,null,null,null,null,null,null,null,null,null,null,7914,"Katádfa","Baranya"]
[null,null,null,null,null,null,null,null,null,null,null,null,null,null,null,null,null,null,null,null,9915,"Katafa","Vas"]
[null,null,null,null,null,null,null,null,null,null,null,null,null,null,null,null,null,null,null,null,7661,"Kátoly","Baranya"]
[null,null,null,null,null,null,null,null,null,null,null,null,null,null,null,null,null,null,null,null,6455,"Katymár","Bács-Kiskun"]
[null,null,null,null,null,null,null,null,null,null,null,null,null,null,null,null,null,null,null,null,2215,"Káva","Pest"]
[null,null,null,null,null,null,null,null,null,null,null,null,null,null,null,null,null,null,null,null,8994,"Kávás","Zala"]
[null,null,null,null,null,null,null,null,null,null,null,null,null,null,null,null,null,null,null,null,3147,"Kazár","Nógrád"]
[null,null,null,null,null,null,null,null,null,null,null,null,null,null,null,null,null,null,null,null,3127,"Kazár","Nógrád"]
[null,null,null,null,null,null,null,null,null,null,null,null,null,null,null,null,null,null,null,null,3700,"Kazincbarcika","Borsod-Abaúj-Zemplén"]
[null,null,null,null,null,null,null,null,null,null,null,null,null,null,null,null,null,null,null,null,3831,"Kázsmárk","Borsod-Abaúj-Zemplén"]
[null,null,null,null,null,null,null,null,null,null,null,null,null,null,null,null,null,null,null,null,7274,"Kazsok","Somogy"]
[null,null,null,null,null,null,null,null,null,null,null,null,null,null,null,null,null,null,null,null,6237,"Kecel","Bács-Kiskun"]
[null,null,null,null,null,null,null,null,null,null,null,null,null,null,null,null,null,null,null,null,2852,"Kecskéd","Komárom-Esztergom"]
[null,null,null,null,null,null,null,null,null,null,null,null,null,null,null,null,null,null,null,null,6044,"Kecskemét","Bács-Kiskun"]
[null,null,null,null,null,null,null,null,null,null,null,null,null,null,null,null,null,null,null,null,6008,"Kecskemét","Bács-Kiskun"]
[null,null,null,null,null,null,null,null,null,null,null,null,null,null,null,null,null,null,null,null,6000,"Kecskemét","Bács-Kiskun"]
[null,null,null,null,null,null,null,null,null,null,null,null,null,null,null,null,null,null,null,null,8784,"Kehidakustány","Zala"]
[null,null,null,null,null,null,null,null,null,null,null,null,null,null,null,null,null,null,null,null,4515,"Kék","Szabolcs-Szatmár-Bereg"]
[null,null,null,null,null,null,null,null,null,null,null,null,null,null,null,null,null,null,null,null,4494,"Kékcse","Szabolcs-Szatmár-Bereg"]
[null,null,null,null,null,null,null,null,null,null,null,null,null,null,null,null,null,null,null,null,3899,"Kéked","Borsod-Abaúj-Zemplén"]
[null,null,null,null,null,null,null,null,null,null,null,null,null,null,null,null,null,null,null,null,7661,"Kékesd","Baranya"]
[null,null,null,null,null,null,null,null,null,null,null,null,null,null,null,null,null,null,null,null,8254,"Kékkút","Veszprém"]
[null,null,null,null,null,null,null,null,null,null,null,null,null,null,null,null,null,null,null,null,6423,"Kelebia","Bács-Kiskun"]
[null,null,null,null,null,null,null,null,null,null,null,null,null,null,null,null,null,null,null,null,9549,"Keléd","Vas"]
[null,null,null,null,null,null,null,null,null,null,null,null,null,null,null,null,null,null,null,null,3728,"Kelemér","Borsod-Abaúj-Zemplén"]
[null,null,null,null,null,null,null,null,null,null,null,null,null,null,null,null,null,null,null,null,6444,"Kéleshalom","Bács-Kiskun"]
[null,null,null,null,null,null,null,null,null,null,null,null,null,null,null,null,null,null,null,null,8714,"Kelevíz","Somogy"]
[null,null,null,null,null,null,null,null,null,null,null,null,null,null,null,null,null,null,null,null,4501,"Kemecse","Szabolcs-Szatmár-Bereg"]
[null,null,null,null,null,null,null,null,null,null,null,null,null,null,null,null,null,null,null,null,2638,"Kemence","Pest"]
[null,null,null,null,null,null,null,null,null,null,null,null,null,null,null,null,null,null,null,null,8931,"Kemendollár","Zala"]
[null,null,null,null,null,null,null,null,null,null,null,null,null,null,null,null,null,null,null,null,8516,"Kemeneshőgyész","Veszprém"]
[null,null,null,null,null,null,null,null,null,null,null,null,null,null,null,null,null,null,null,null,9553,"Kemeneskápolna","Vas"]
[null,null,null,null,null,null,null,null,null,null,null,null,null,null,null,null,null,null,null,null,9522,"Kemenesmagasi","Vas"]
[null,null,null,null,null,null,null,null,null,null,null,null,null,null,null,null,null,null,null,null,9511,"Kemenesmihályfa","Vas"]
[null,null,null,null,null,null,null,null,null,null,null,null,null,null,null,null,null,null,null,null,9544,"Kemenespálfa","Vas"]
[null,null,null,null,null,null,null,null,null,null,null,null,null,null,null,null,null,null,null,null,9517,"Kemenessömjén","Vas"]
[null,null,null,null,null,null,null,null,null,null,null,null,null,null,null,null,null,null,null,null,9521,"Kemenesszentmárton","Vas"]
[null,null,null,null,null,null,null,null,null,null,null,null,null,null,null,null,null,null,null,null,8518,"Kemenesszentpéter","Veszprém"]
[null,null,null,null,null,null,null,null,null,null,null,null,null,null,null,null,null,null,null,null,8995,"Keménfa","Zala"]
[null,null,null,null,null,null,null,null,null,null,null,null,null,null,null,null,null,null,null,null,7843,"Kémes","Baranya"]
[null,null,null,null,null,null,null,null,null,null,null,null,null,null,null,null,null,null,null,null,9923,"Kemestaródfa","Vas"]
[null,null,null,null,null,null,null,null,null,null,null,null,null,null,null,null,null,null,null,null,7839,"Kemse","Baranya"]
[null,null,null,null,null,null,null,null,null,null,null,null,null,null,null,null,null,null,null,null,5349,"Kenderes","Jász-Nagykun-Szolnok"]
[null,null,null,null,null,null,null,null,null,null,null,null,null,null,null,null,null,null,null,null,5331,"Kenderes","Jász-Nagykun-Szolnok"]
[null,null,null,null,null,null,null,null,null,null,null,null,null,null,null,null,null,null,null,null,9752,"Kenéz","Vas"]
[null,null,null,null,null,null,null,null,null,null,null,null,null,null,null,null,null,null,null,null,3955,"Kenézlő","Borsod-Abaúj-Zemplén"]
[null,null,null,null,null,null,null,null,null,null,null,null,null,null,null,null,null,null,null,null,5083,"Kengyel","Jász-Nagykun-Szolnok"]
[null,null,null,null,null,null,null,null,null,null,null,null,null,null,null,null,null,null,null,null,9514,"Kenyeri","Vas"]
[null,null,null,null,null,null,null,null,null,null,null,null,null,null,null,null,null,null,null,null,9945,"Kercaszomor","Vas"]
[null,null,null,null,null,null,null,null,null,null,null,null,null,null,null,null,null,null,null,null,7256,"Kercseliget","Somogy"]
[null,null,null,null,null,null,null,null,null,null,null,null,null,null,null,null,null,null,null,null,3396,"Kerecsend","Heves"]
[null,null,null,null,null,null,null,null,null,null,null,null,null,null,null,null,null,null,null,null,8745,"Kerecseny","Zala"]
[null,null,null,null,null,null,null,null,null,null,null,null,null,null,null,null,null,null,null,null,6041,"Kerekegyháza","Bács-Kiskun"]
[null,null,null,null,null,null,null,null,null,null,null,null,null,null,null,null,null,null,null,null,8618,"Kereki","Somogy"]
[null,null,null,null,null,null,null,null,null,null,null,null,null,null,null,null,null,null,null,null,2882,"Kerékteleki","Komárom-Esztergom"]
[null,null,null,null,null,null,null,null,null,null,null,null,null,null,null,null,null,null,null,null,2145,"Kerepes","Pest"]
[null,null,null,null,null,null,null,null,null,null,null,null,null,null,null,null,null,null,null,null,2144,"Kerepes","Pest"]
[null,null,null,null,null,null,null,null,null,null,null,null,null,null,null,null,null,null,null,null,3821,"Keresztéte","Borsod-Abaúj-Zemplén"]
[null,null,null,null,null,null,null,null,null,null,null,null,null,null,null,null,null,null,null,null,8971,"Kerkabarabás","Zala"]
[null,null,null,null,null,null,null,null,null,null,null,null,null,null,null,null,null,null,null,null,8973,"Kerkafalva","Zala"]
[null,null,null,null,null,null,null,null,null,null,null,null,null,null,null,null,null,null,null,null,8973,"Kerkakutas","Zala"]
[null,null,null,null,null,null,null,null,null,null,null,null,null,null,null,null,null,null,null,null,9944,"Kerkáskápolna","Vas"]
[null,null,null,null,null,null,null,null,null,null,null,null,null,null,null,null,null,null,null,null,8874,"Kerkaszentkirály","Zala"]
[null,null,null,null,null,null,null,null,null,null,null,null,null,null,null,null,null,null,null,null,8879,"Kerkateskánd","Zala"]
[null,null,null,null,null,null,null,null,null,null,null,null,null,null,null,null,null,null,null,null,4912,"Kérsemjén","Szabolcs-Szatmár-Bereg"]
[null,null,null,null,null,null,null,null,null,null,null,null,null,null,null,null,null,null,null,null,8492,"Kerta","Veszprém"]
[null,null,null,null,null,null,null,null,null,null,null,null,null,null,null,null,null,null,null,null,5526,"Kertészsziget","Békés"]
[null,null,null,null,null,null,null,null,null,null,null,null,null,null,null,null,null,null,null,null,2616,"Keszeg","Nógrád"]
[null,null,null,null,null,null,null,null,null,null,null,null,null,null,null,null,null,null,null,null,3579,"Kesznyéten","Borsod-Abaúj-Zemplén"]
[null,null,null,null,null,null,null,null,null,null,null,null,null,null,null,null,null,null,null,null,7062,"Keszőhidegkút","Tolna"]
[null,null,null,null,null,null,null,null,null,null,null,null,null,null,null,null,null,null,null,null,8360,"Keszthely","Zala"]
[null,null,null,null,null,null,null,null,null,null,null,null,null,null,null,null,null,null,null,null,2517,"Kesztölc","Komárom-Esztergom"]
[null,null,null,null,null,null,null,null,null,null,null,null,null,null,null,null,null,null,null,null,7668,"Keszü","Baranya"]
[null,null,null,null,null,null,null,null,null,null,null,null,null,null,null,null,null,null,null,null,2655,"Kétbodony","Nógrád"]
[null,null,null,null,null,null,null,null,null,null,null,null,null,null,null,null,null,null,null,null,5741,"Kétegyháza","Békés"]
[null,null,null,null,null,null,null,null,null,null,null,null,null,null,null,null,null,null,null,null,8713,"Kéthely","Somogy"]
[null,null,null,null,null,null,null,null,null,null,null,null,null,null,null,null,null,null,null,null,5411,"Kétpó","Jász-Nagykun-Szolnok"]
[null,null,null,null,null,null,null,null,null,null,null,null,null,null,null,null,null,null,null,null,5674,"Kétsoprony","Békés"]
[null,null,null,null,null,null,null,null,null,null,null,null,null,null,null,null,null,null,null,null,7975,"Kétújfalu","Baranya"]
[null,null,null,null,null,null,null,null,null,null,null,null,null,null,null,null,null,null,null,null,9982,"Kétvölgy","Vas"]
[null,null,null,null,null,null,null,null,null,null,null,null,null,null,null,null,null,null,null,null,7174,"Kéty","Tolna"]
[null,null,null,null,null,null,null,null,null,null,null,null,null,null,null,null,null,null,null,null,5744,"Kevermes","Békés"]
[null,null,null,null,null,null,null,null,null,null,null,null,null,null,null,null,null,null,null,null,8774,"Kilimán","Zala"]
[null,null,null,null,null,null,null,null,null,null,null,null,null,null,null,null,null,null,null,null,9181,"Kimle","Győr-Moson-Sopron"]
[null,null,null,null,null,null,null,null,null,null,null,null,null,null,null,null,null,null,null,null,8044,"Kincsesbánya","Fejér"]
[null,null,null,null,null,null,null,null,null,null,null,null,null,null,null,null,null,null,null,null,3657,"Királd","Borsod-Abaúj-Zemplén"]
[null,null,null,null,null,null,null,null,null,null,null,null,null,null,null,null,null,null,null,null,7953,"Királyegyháza","Baranya"]
[null,null,null,null,null,null,null,null,null,null,null,null,null,null,null,null,null,null,null,null,6911,"Királyhegyes","Csongrád"]
[null,null,null,null,null,null,null,null,null,null,null,null,null,null,null,null,null,null,null,null,8195,"Királyszentistván","Veszprém"]
[null,null,null,null,null,null,null,null,null,null,null,null,null,null,null,null,null,null,null,null,8284,"Kisapáti","Veszprém"]
[null,null,null,null,null,null,null,null,null,null,null,null,null,null,null,null,null,null,null,null,2428,"Kisapostag","Fejér"]
[null,null,null,null,null,null,null,null,null,null,null,null,null,null,null,null,null,null,null,null,4921,"Kisar","Szabolcs-Szatmár-Bereg"]
[null,null,null,null,null,null,null,null,null,null,null,null,null,null,null,null,null,null,null,null,7523,"Kisasszond","Somogy"]
[null,null,null,null,null,null,null,null,null,null,null,null,null,null,null,null,null,null,null,null,7954,"Kisasszonyfa","Baranya"]
[null,null,null,null,null,null,null,null,null,null,null,null,null,null,null,null,null,null,null,null,9133,"Kisbabot","Győr-Moson-Sopron"]
[null,null,null,null,null,null,null,null,null,null,null,null,null,null,null,null,null,null,null,null,3046,"Kisbágyon","Nógrád"]
[null,null,null,null,null,null,null,null,null,null,null,null,null,null,null,null,null,null,null,null,9062,"Kisbajcs","Győr-Moson-Sopron"]
[null,null,null,null,null,null,null,null,null,null,null,null,null,null,null,null,null,null,null,null,7542,"Kisbajom","Somogy"]
[null,null,null,null,null,null,null,null,null,null,null,null,null,null,null,null,null,null,null,null,7282,"Kisbárapáti","Somogy"]
[null,null,null,null,null,null,null,null,null,null,null,null,null,null,null,null,null,null,null,null,3075,"Kisbárkány","Nógrád"]
[null,null,null,null,null,null,null,null,null,null,null,null,null,null,null,null,null,null,null,null,2881,"Kisbér","Komárom-Esztergom"]
[null,null,null,null,null,null,null,null,null,null,null,null,null,null,null,null,null,null,null,null,2879,"Kisbér","Komárom-Esztergom"]
[null,null,null,null,null,null,null,null,null,null,null,null,null,null,null,null,null,null,null,null,2870,"Kisbér","Komárom-Esztergom"]
[null,null,null,null,null,null,null,null,null,null,null,null,null,null,null,null,null,null,null,null,8693,"Kisberény","Somogy"]
[null,null,null,null,null,null,null,null,null,null,null,null,null,null,null,null,null,null,null,null,8477,"Kisberzseny","Veszprém"]
[null,null,null,null,null,null,null,null,null,null,null,null,null,null,null,null,null,null,null,null,7391,"Kisbeszterce","Baranya"]
[null,null,null,null,null,null,null,null,null,null,null,null,null,null,null,null,null,null,null,null,9234,"Kisbodak","Győr-Moson-Sopron"]
[null,null,null,null,null,null,null,null,null,null,null,null,null,null,null,null,null,null,null,null,8925,"Kisbucsa","Zala"]
[null,null,null,null,null,null,null,null,null,null,null,null,null,null,null,null,null,null,null,null,7756,"Kisbudmér","Baranya"]
[null,null,null,null,null,null,null,null,null,null,null,null,null,null,null,null,null,null,null,null,3578,"Kiscsécs","Borsod-Abaúj-Zemplén"]
[null,null,null,null,null,null,null,null,null,null,null,null,null,null,null,null,null,null,null,null,8888,"Kiscsehi","Zala"]
[null,null,null,null,null,null,null,null,null,null,null,null,null,null,null,null,null,null,null,null,8494,"Kiscsősz","Veszprém"]
[null,null,null,null,null,null,null,null,null,null,null,null,null,null,null,null,null,null,null,null,7814,"Kisdér","Baranya"]
[null,null,null,null,null,null,null,null,null,null,null,null,null,null,null,null,null,null,null,null,7985,"Kisdobsza","Baranya"]
[null,null,null,null,null,null,null,null,null,null,null,null,null,null,null,null,null,null,null,null,5837,"Kisdombegyház","Békés"]
[null,null,null,null,null,null,null,null,null,null,null,null,null,null,null,null,null,null,null,null,7159,"Kisdorog","Tolna"]
[null,null,null,null,null,null,null,null,null,null,null,null,null,null,null,null,null,null,null,null,2655,"Kisecset","Nógrád"]
[null,null,null,null,null,null,null,null,null,null,null,null,null,null,null,null,null,null,null,null,9341,"Kisfalud","Győr-Moson-Sopron"]
[null,null,null,null,null,null,null,null,null,null,null,null,null,null,null,null,null,null,null,null,3256,"Kisfüzes","Heves"]
[null,null,null,null,null,null,null,null,null,null,null,null,null,null,null,null,null,null,null,null,8356,"Kisgörbő","Zala"]
[null,null,null,null,null,null,null,null,null,null,null,null,null,null,null,null,null,null,null,null,7279,"Kisgyalán","Somogy"]
[null,null,null,null,null,null,null,null,null,null,null,null,null,null,null,null,null,null,null,null,3556,"Kisgyőr","Borsod-Abaúj-Zemplén"]
[null,null,null,null,null,null,null,null,null,null,null,null,null,null,null,null,null,null,null,null,7391,"Kishajmás","Baranya"]
[null,null,null,null,null,null,null,null,null,null,null,null,null,null,null,null,null,null,null,null,7800,"Kisharsány","Baranya"]
[null,null,null,null,null,null,null,null,null,null,null,null,null,null,null,null,null,null,null,null,3161,"Kishartyán","Nógrád"]
[null,null,null,null,null,null,null,null,null,null,null,null,null,null,null,null,null,null,null,null,7763,"Kisherend","Baranya"]
[null,null,null,null,null,null,null,null,null,null,null,null,null,null,null,null,null,null,null,null,4977,"Kishódos","Szabolcs-Szatmár-Bereg"]
[null,null,null,null,null,null,null,null,null,null,null,null,null,null,null,null,null,null,null,null,3994,"Kishuta","Borsod-Abaúj-Zemplén"]
[null,null,null,null,null,null,null,null,null,null,null,null,null,null,null,null,null,null,null,null,2948,"Kisigmánd","Komárom-Esztergom"]
[null,null,null,null,null,null,null,null,null,null,null,null,null,null,null,null,null,null,null,null,7773,"Kisjakabfalva","Baranya"]
[null,null,null,null,null,null,null,null,null,null,null,null,null,null,null,null,null,null,null,null,7766,"Kiskassa","Baranya"]
[null,null,null,null,null,null,null,null,null,null,null,null,null,null,null,null,null,null,null,null,3843,"Kiskinizs","Borsod-Abaúj-Zemplén"]
[null,null,null,null,null,null,null,null,null,null,null,null,null,null,null,null,null,null,null,null,3384,"Kisköre","Somogy"]
[null,null,null,null,null,null,null,null,null,null,null,null,null,null,null,null,null,null,null,null,6200,"Kiskőrös","Heves"]
[null,null,null,null,null,null,null,null,null,null,null,null,null,null,null,null,null,null,null,null,7524,"Kiskorpád","Bács-Kiskun"]
[null,null,null,null,null,null,null,null,null,null,null,null,null,null,null,null,null,null,null,null,6100,"Kiskunfélegyháza","Bács-Kiskun"]
[null,null,null,null,null,null,null,null,null,null,null,null,null,null,null,null,null,null,null,null,6400,"Kiskunhalas","Bács-Kiskun"]
[null,null,null,null,null,null,null,null,null,null,null,null,null,null,null,null,null,null,null,null,2340,"Kiskunlacháza","Pest"]
[null,null,null,null,null,null,null,null,null,null,null,null,null,null,null,null,null,null,null,null,6120,"Kiskunmajsa","Bács-Kiskun"]
[null,null,null,null,null,null,null,null,null,null,null,null,null,null,null,null,null,null,null,null,8911,"Kiskutas","Zala"]
[null,null,null,null,null,null,null,null,null,null,null,null,null,null,null,null,null,null,null,null,8156,"Kisláng","Fejér"]
[null,null,null,null,null,null,null,null,null,null,null,null,null,null,null,null,null,null,null,null,4325,"Kisléta","Szabolcs-Szatmár-Bereg"]
[null,null,null,null,null,null,null,null,null,null,null,null,null,null,null,null,null,null,null,null,7775,"Kislippó","Baranya"]
[null,null,null,null,null,null,null,null,null,null,null,null,null,null,null,null,null,null,null,null,8446,"Kislőd","Veszprém"]
[null,null,null,null,null,null,null,null,null,null,null,null,null,null,null,null,null,null,null,null,7356,"Kismányok","Tolna"]
[null,null,null,null,null,null,null,null,null,null,null,null,null,null,null,null,null,null,null,null,4126,"Kismarja","Hajdú-Bihar"]
[null,null,null,null,null,null,null,null,null,null,null,null,null,null,null,null,null,null,null,null,2623,"Kismaros","Pest"]
[null,null,null,null,null,null,null,null,null,null,null,null,null,null,null,null,null,null,null,null,4737,"Kisnamény","Szabolcs-Szatmár-Bereg"]
[null,null,null,null,null,null,null,null,null,null,null,null,null,null,null,null,null,null,null,null,3264,"Kisnána","Heves"]
[null,null,null,null,null,null,null,null,null,null,null,null,null,null,null,null,null,null,null,null,2165,"Kisnémedi","Pest"]
[null,null,null,null,null,null,null,null,null,null,null,null,null,null,null,null,null,null,null,null,7759,"Kisnyárád","Baranya"]
[null,null,null,null,null,null,null,null,null,null,null,null,null,null,null,null,null,null,null,null,2024,"Kisoroszi","Pest"]
[null,null,null,null,null,null,null,null,null,null,null,null,null,null,null,null,null,null,null,null,4956,"Kispalád","Szabolcs-Szatmár-Bereg"]
[null,null,null,null,null,null,null,null,null,null,null,null,null,null,null,null,null,null,null,null,8912,"Kispáli","Zala"]
[null,null,null,null,null,null,null,null,null,null,null,null,null,null,null,null,null,null,null,null,8496,"Kispirit","Veszprém"]
[null,null,null,null,null,null,null,null,null,null,null,null,null,null,null,null,null,null,null,null,9936,"Kisrákos","Vas"]
[null,null,null,null,null,null,null,null,null,null,null,null,null,null,null,null,null,null,null,null,8756,"Kisrécse","Zala"]
[null,null,null,null,null,null,null,null,null,null,null,null,null,null,null,null,null,null,null,null,3965,"Kisrozvágy","Borsod-Abaúj-Zemplén"]
[null,null,null,null,null,null,null,null,null,null,null,null,null,null,null,null,null,null,null,null,3627,"Kissikátor","Borsod-Abaúj-Zemplén"]
[null,null,null,null,null,null,null,null,null,null,null,null,null,null,null,null,null,null,null,null,9555,"Kissomlyó","Vas"]
[null,null,null,null,null,null,null,null,null,null,null,null,null,null,null,null,null,null,null,null,6421,"Kisszállás","Bács-Kiskun"]
[null,null,null,null,null,null,null,null,null,null,null,null,null,null,null,null,null,null,null,null,7082,"Kisszékely","Tolna"]
[null,null,null,null,null,null,null,null,null,null,null,null,null,null,null,null,null,null,null,null,4963,"Kisszekeres","Szabolcs-Szatmár-Bereg"]
[null,null,null,null,null,null,null,null,null,null,null,null,null,null,null,null,null,null,null,null,7841,"Kisszentmárton","Baranya"]
[null,null,null,null,null,null,null,null,null,null,null,null,null,null,null,null,null,null,null,null,8957,"Kissziget","Zala"]
[null,null,null,null,null,null,null,null,null,null,null,null,null,null,null,null,null,null,null,null,8483,"Kisszőlős","Veszprém"]
[null,null,null,null,null,null,null,null,null,null,null,null,null,null,null,null,null,null,null,null,7981,"Kistamási","Baranya"]
[null,null,null,null,null,null,null,null,null,null,null,null,null,null,null,null,null,null,null,null,7823,"Kistapolca","Baranya"]
[null,null,null,null,null,null,null,null,null,null,null,null,null,null,null,null,null,null,null,null,2143,"Kistarcsa","Pest"]
[null,null,null,null,null,null,null,null,null,null,null,null,null,null,null,null,null,null,null,null,6760,"Kistelek","Csongrád"]
[null,null,null,null,null,null,null,null,null,null,null,null,null,null,null,null,null,null,null,null,3553,"Kistokaj","Borsod-Abaúj-Zemplén"]
[null,null,null,null,null,null,null,null,null,null,null,null,null,null,null,null,null,null,null,null,8868,"Kistolmács","Zala"]
[null,null,null,null,null,null,null,null,null,null,null,null,null,null,null,null,null,null,null,null,7068,"Kistormás","Tolna"]
[null,null,null,null,null,null,null,null,null,null,null,null,null,null,null,null,null,null,null,null,7768,"Kistótfalu","Baranya"]
[null,null,null,null,null,null,null,null,null,null,null,null,null,null,null,null,null,null,null,null,5310,"Kisújszállás","Jász-Nagykun-Szolnok"]
[null,null,null,null,null,null,null,null,null,null,null,null,null,null,null,null,null,null,null,null,9772,"Kisunyom","Vas"]
[null,null,null,null,null,null,null,null,null,null,null,null,null,null,null,null,null,null,null,null,4600,"Kisvárda","Szabolcs-Szatmár-Bereg"]
[null,null,null,null,null,null,null,null,null,null,null,null,null,null,null,null,null,null,null,null,4811,"Kisvarsány","Szabolcs-Szatmár-Bereg"]
[null,null,null,null,null,null,null,null,null,null,null,null,null,null,null,null,null,null,null,null,8341,"Kisvásárhely","Zala"]
[null,null,null,null,null,null,null,null,null,null,null,null,null,null,null,null,null,null,null,null,7381,"Kisvaszar","Baranya"]
[null,null,null,null,null,null,null,null,null,null,null,null,null,null,null,null,null,null,null,null,7183,"Kisvejke","Tolna"]
[null,null,null,null,null,null,null,null,null,null,null,null,null,null,null,null,null,null,null,null,6775,"Kiszombor","Csongrád"]
[null,null,null,null,null,null,null,null,null,null,null,null,null,null,null,null,null,null,null,null,9733,"Kiszsidány","Vas"]
[null,null,null,null,null,null,null,null,null,null,null,null,null,null,null,null,null,null,null,null,6773,"Klárafalva","Csongrád"]
[null,null,null,null,null,null,null,null,null,null,null,null,null,null,null,null,null,null,null,null,7334,"Köblény","Komárom-Esztergom"]
[null,null,null,null,null,null,null,null,null,null,null,null,null,null,null,null,null,null,null,null,2898,"Kocs","Pest"]
[null,null,null,null,null,null,null,null,null,null,null,null,null,null,null,null,null,null,null,null,2755,"Kocsér","Tolna"]
[null,null,null,null,null,null,null,null,null,null,null,null,null,null,null,null,null,null,null,null,9553,"Köcsk","Szabolcs-Szatmár-Bereg"]
[null,null,null,null,null,null,null,null,null,null,null,null,null,null,null,null,null,null,null,null,7212,"Kocsola","Pest"]
[null,null,null,null,null,null,null,null,null,null,null,null,null,null,null,null,null,null,null,null,4751,"Kocsord","Hajdú-Bihar"]
[null,null,null,null,null,null,null,null,null,null,null,null,null,null,null,null,null,null,null,null,2243,"Kóka","Veszprém"]
[null,null,null,null,null,null,null,null,null,null,null,null,null,null,null,null,null,null,null,null,4284,"Kokad","Hajdú-Bihar"]
[null,null,null,null,null,null,null,null,null,null,null,null,null,null,null,null,null,null,null,null,7668,"Kökény","Komárom-Esztergom"]
[null,null,null,null,null,null,null,null,null,null,null,null,null,null,null,null,null,null,null,null,7530,"Kőkút","Komárom-Esztergom"]
[null,null,null,null,null,null,null,null,null,null,null,null,null,null,null,null,null,null,null,null,4965,"Kölcse","Komárom-Esztergom"]
[null,null,null,null,null,null,null,null,null,null,null,null,null,null,null,null,null,null,null,null,7052,"Kölesd","Borsod-Abaúj-Zemplén"]
[null,null,null,null,null,null,null,null,null,null,null,null,null,null,null,null,null,null,null,null,7717,"Kölked","Baranya"]
[null,null,null,null,null,null,null,null,null,null,null,null,null,null,null,null,null,null,null,null,8468,"Kolontár","Baranya"]
[null,null,null,null,null,null,null,null,null,null,null,null,null,null,null,null,null,null,null,null,4138,"Komádi","Szabolcs-Szatmár-Bereg"]
[null,null,null,null,null,null,null,null,null,null,null,null,null,null,null,null,null,null,null,null,2903,"Komárom","Somogy"]
[null,null,null,null,null,null,null,null,null,null,null,null,null,null,null,null,null,null,null,null,2921,"Komárom","Borsod-Abaúj-Zemplén"]
[null,null,null,null,null,null,null,null,null,null,null,null,null,null,null,null,null,null,null,null,2900,"Komárom","Szabolcs-Szatmár-Bereg"]
[null,null,null,null,null,null,null,null,null,null,null,null,null,null,null,null,null,null,null,null,3765,"Komjáti","Heves"]
[null,null,null,null,null,null,null,null,null,null,null,null,null,null,null,null,null,null,null,null,7305,"Komló","Borsod-Abaúj-Zemplén"]
[null,null,null,null,null,null,null,null,null,null,null,null,null,null,null,null,null,null,null,null,7300,"Komló","Vas"]
[null,null,null,null,null,null,null,null,null,null,null,null,null,null,null,null,null,null,null,null,3372,"Kömlő","Békés"]
[null,null,null,null,null,null,null,null,null,null,null,null,null,null,null,null,null,null,null,null,2853,"Kömlőd","Győr-Moson-Sopron"]
[null,null,null,null,null,null,null,null,null,null,null,null,null,null,null,null,null,null,null,null,4765,"Komlódtótfalu","Hajdú-Bihar"]
[null,null,null,null,null,null,null,null,null,null,null,null,null,null,null,null,null,null,null,null,7582,"Komlósd","Győr-Moson-Sopron"]
[null,null,null,null,null,null,null,null,null,null,null,null,null,null,null,null,null,null,null,null,3937,"Komlóska","Tolna"]
[null,null,null,null,null,null,null,null,null,null,null,null,null,null,null,null,null,null,null,null,4622,"Komoró","Borsod-Abaúj-Zemplén"]
[null,null,null,null,null,null,null,null,null,null,null,null,null,null,null,null,null,null,null,null,4943,"Kömörő","Győr-Moson-Sopron"]
[null,null,null,null,null,null,null,null,null,null,null,null,null,null,null,null,null,null,null,null,6134,"Kömpöc","Baranya"]
[null,null,null,null,null,null,null,null,null,null,null,null,null,null,null,null,null,null,null,null,3356,"Kompolt","Pest"]
[null,null,null,null,null,null,null,null,null,null,null,null,null,null,null,null,null,null,null,null,3775,"Kondó","Pest"]
[null,null,null,null,null,null,null,null,null,null,null,null,null,null,null,null,null,null,null,null,9943,"Kondorfa","Szabolcs-Szatmár-Bereg"]
[null,null,null,null,null,null,null,null,null,null,null,null,null,null,null,null,null,null,null,null,5553,"Kondoros","Baranya"]
[null,null,null,null,null,null,null,null,null,null,null,null,null,null,null,null,null,null,null,null,9144,"Kóny","Baranya"]
[null,null,null,null,null,null,null,null,null,null,null,null,null,null,null,null,null,null,null,null,4133,"Konyár","Borsod-Abaúj-Zemplén"]
[null,null,null,null,null,null,null,null,null,null,null,null,null,null,null,null,null,null,null,null,9495,"Kópháza","Nógrád"]
[null,null,null,null,null,null,null,null,null,null,null,null,null,null,null,null,null,null,null,null,7094,"Koppányszántó","Baranya"]
[null,null,null,null,null,null,null,null,null,null,null,null,null,null,null,null,null,null,null,null,3886,"Korlát","Zala"]
[null,null,null,null,null,null,null,null,null,null,null,null,null,null,null,null,null,null,null,null,9909,"Körmend","Baranya"]
[null,null,null,null,null,null,null,null,null,null,null,null,null,null,null,null,null,null,null,null,9900,"Körmend","Vas"]
[null,null,null,null,null,null,null,null,null,null,null,null,null,null,null,null,null,null,null,null,2851,"Környe","Baranya"]
[null,null,null,null,null,null,null,null,null,null,null,null,null,null,null,null,null,null,null,null,3577,"Köröm","Somogy"]
[null,null,null,null,null,null,null,null,null,null,null,null,null,null,null,null,null,null,null,null,9113,"Koroncó","Szabolcs-Szatmár-Bereg"]
[null,null,null,null,null,null,null,null,null,null,null,null,null,null,null,null,null,null,null,null,7841,"Kórós","Tolna"]
[null,null,null,null,null,null,null,null,null,null,null,null,null,null,null,null,null,null,null,null,8617,"Kőröshegy","Baranya"]
[null,null,null,null,null,null,null,null,null,null,null,null,null,null,null,null,null,null,null,null,5516,"Körösladány","Heves"]
[null,null,null,null,null,null,null,null,null,null,null,null,null,null,null,null,null,null,null,null,5539,"Körösnagyharsány","Komárom-Esztergom"]
[null,null,null,null,null,null,null,null,null,null,null,null,null,null,null,null,null,null,null,null,4136,"Körösszakál","Szabolcs-Szatmár-Bereg"]
[null,null,null,null,null,null,null,null,null,null,null,null,null,null,null,null,null,null,null,null,4135,"Körösszegapáti","Bács-Kiskun"]
[null,null,null,null,null,null,null,null,null,null,null,null,null,null,null,null,null,null,null,null,5622,"Köröstarcsa","Vas"]
[null,null,null,null,null,null,null,null,null,null,null,null,null,null,null,null,null,null,null,null,2745,"Kőröstetétlen","Vas"]
[null,null,null,null,null,null,null,null,null,null,null,null,null,null,null,null,null,null,null,null,5536,"Körösújfalu","Komárom-Esztergom"]
[null,null,null,null,null,null,null,null,null,null,null,null,null,null,null,null,null,null,null,null,2612,"Kosd","Borsod-Abaúj-Zemplén"]
[null,null,null,null,null,null,null,null,null,null,null,null,null,null,null,null,null,null,null,null,2625,"Kóspallag","Somogy"]
[null,null,null,null,null,null,null,null,null,null,null,null,null,null,null,null,null,null,null,null,8152,"Kőszárhegy","Békés"]
[null,null,null,null,null,null,null,null,null,null,null,null,null,null,null,null,null,null,null,null,9730,"Kőszeg","Békés"]
[null,null,null,null,null,null,null,null,null,null,null,null,null,null,null,null,null,null,null,null,9725,"Kőszegdoroszló","Békés"]
[null,null,null,null,null,null,null,null,null,null,null,null,null,null,null,null,null,null,null,null,9739,"Kőszegpaty","Pest"]
[null,null,null,null,null,null,null,null,null,null,null,null,null,null,null,null,null,null,null,null,9725,"Kőszegszerdahely","Békés"]
[null,null,null,null,null,null,null,null,null,null,null,null,null,null,null,null,null,null,null,null,4482,"Kótaj","Hajdú-Bihar"]
[null,null,null,null,null,null,null,null,null,null,null,null,null,null,null,null,null,null,null,null,8627,"Kötcse","Hajdú-Bihar"]
[null,null,null,null,null,null,null,null,null,null,null,null,null,null,null,null,null,null,null,null,5725,"Kötegyán","Fejér"]
[null,null,null,null,null,null,null,null,null,null,null,null,null,null,null,null,null,null,null,null,5062,"Kőtelek","Vas"]
[null,null,null,null,null,null,null,null,null,null,null,null,null,null,null,null,null,null,null,null,7847,"Kovácshida","Vas"]
[null,null,null,null,null,null,null,null,null,null,null,null,null,null,null,null,null,null,null,null,7678,"Kovácsszénája","Vas"]
[null,null,null,null,null,null,null,null,null,null,null,null,null,null,null,null,null,null,null,null,3992,"Kovácsvágás","Vas"]
[null,null,null,null,null,null,null,null,null,null,null,null,null,null,null,null,null,null,null,null,8254,"Kővágóörs","Somogy"]
[null,null,null,null,null,null,null,null,null,null,null,null,null,null,null,null,null,null,null,null,7673,"Kővágószőlős","Békés"]
[null,null,null,null,null,null,null,null,null,null,null,null,null,null,null,null,null,null,null,null,7675,"Kővágótőttős","Jász-Nagykun-Szolnok"]
[null,null,null,null,null,null,null,null,null,null,null,null,null,null,null,null,null,null,null,null,6912,"Kövegy","Veszprém"]
[null,null,null,null,null,null,null,null,null,null,null,null,null,null,null,null,null,null,null,null,8274,"Köveskál","Baranya"]
[null,null,null,null,null,null,null,null,null,null,null,null,null,null,null,null,null,null,null,null,3053,"Kozárd","Baranya"]
[null,null,null,null,null,null,null,null,null,null,null,null,null,null,null,null,null,null,null,null,7761,"Kozármisleny","Csongrád"]
[null,null,null,null,null,null,null,null,null,null,null,null,null,null,null,null,null,null,null,null,8988,"Kozmadombja","Veszprém"]
[null,null,null,null,null,null,null,null,null,null,null,null,null,null,null,null,null,null,null,null,3821,"Krasznokvajda","Borsod-Abaúj-Zemplén"]
[null,null,null,null,null,null,null,null,null,null,null,null,null,null,null,null,null,null,null,null,6755,"Kübekháza","Fejér"]
[null,null,null,null,null,null,null,null,null,null,null,null,null,null,null,null,null,null,null,null,2458,"Kulcs","Bács-Kiskun"]
[null,null,null,null,null,null,null,null,null,null,null,null,null,null,null,null,null,null,null,null,8978,"Külsősárd","Békés"]
[null,null,null,null,null,null,null,null,null,null,null,null,null,null,null,null,null,null,null,null,9532,"Külsővat","Bács-Kiskun"]
[null,null,null,null,null,null,null,null,null,null,null,null,null,null,null,null,null,null,null,null,6097,"Kunadacs","Bács-Kiskun"]
[null,null,null,null,null,null,null,null,null,null,null,null,null,null,null,null,null,null,null,null,5746,"Kunágota","Jász-Nagykun-Szolnok"]
[null,null,null,null,null,null,null,null,null,null,null,null,null,null,null,null,null,null,null,null,6435,"Kunbaja","Bács-Kiskun"]
[null,null,null,null,null,null,null,null,null,null,null,null,null,null,null,null,null,null,null,null,6043,"Kunbaracs","Jász-Nagykun-Szolnok"]
[null,null,null,null,null,null,null,null,null,null,null,null,null,null,null,null,null,null,null,null,5412,"Kuncsorba","Jász-Nagykun-Szolnok"]
[null,null,null,null,null,null,null,null,null,null,null,null,null,null,null,null,null,null,null,null,6413,"Kunfehértó","Bács-Kiskun"]
[null,null,null,null,null,null,null,null,null,null,null,null,null,null,null,null,null,null,null,null,8162,"Küngös","Bács-Kiskun"]
[null,null,null,null,null,null,null,null,null,null,null,null,null,null,null,null,null,null,null,null,5340,"Kunhegyes","Jász-Nagykun-Szolnok"]
[null,null,null,null,null,null,null,null,null,null,null,null,null,null,null,null,null,null,null,null,5321,"Kunmadaras","Jász-Nagykun-Szolnok"]
[null,null,null,null,null,null,null,null,null,null,null,null,null,null,null,null,null,null,null,null,6096,"Kunpeszér","Bács-Kiskun"]
[null,null,null,null,null,null,null,null,null,null,null,null,null,null,null,null,null,null,null,null,6115,"Kunszállás","Győr-Moson-Sopron"]
[null,null,null,null,null,null,null,null,null,null,null,null,null,null,null,null,null,null,null,null,5449,"Kunszentmárton","Veszprém"]
[null,null,null,null,null,null,null,null,null,null,null,null,null,null,null,null,null,null,null,null,5440,"Kunszentmárton","Borsod-Abaúj-Zemplén"]
[null,null,null,null,null,null,null,null,null,null,null,null,null,null,null,null,null,null,null,null,6090,"Kunszentmiklós","Tolna"]
[null,null,null,null,null,null,null,null,null,null,null,null,null,null,null,null,null,null,null,null,9184,"Kunsziget","Borsod-Abaúj-Zemplén"]
[null,null,null,null,null,null,null,null,null,null,null,null,null,null,null,null,null,null,null,null,8595,"Kup","Zala"]
[null,null,null,null,null,null,null,null,null,null,null,null,null,null,null,null,null,null,null,null,3813,"Kupa","Somogy"]
[null,null,null,null,null,null,null,null,null,null,null,null,null,null,null,null,null,null,null,null,7226,"Kurd","Nógrád"]
[null,null,null,null,null,null,null,null,null,null,null,null,null,null,null,null,null,null,null,null,3732,"Kurityán","Csongrád"]
[null,null,null,null,null,null,null,null,null,null,null,null,null,null,null,null,null,null,null,null,8919,"Kustánszeg","Zala"]
[null,null,null,null,null,null,null,null,null,null,null,null,null,null,null,null,null,null,null,null,7541,"Kutas","Veszprém"]
[null,null,null,null,null,null,null,null,null,null,null,null,null,null,null,null,null,null,null,null,3066,"Kutasó","Veszprém"]
[null,null,null,null,null,null,null,null,null,null,null,null,null,null,null,null,null,null,null,null,2541,"Lábatlan","Komárom-Esztergom"]
[null,null,null,null,null,null,null,null,null,null,null,null,null,null,null,null,null,null,null,null,7551,"Lábod","Somogy"]
[null,null,null,null,null,null,null,null,null,null,null,null,null,null,null,null,null,null,null,null,3967,"Lácacséke","Borsod-Abaúj-Zemplén"]
[null,null,null,null,null,null,null,null,null,null,null,null,null,null,null,null,null,null,null,null,7535,"Lad","Somogy"]
[null,null,null,null,null,null,null,null,null,null,null,null,null,null,null,null,null,null,null,null,6045,"Ladánybene","Bács-Kiskun"]
[null,null,null,null,null,null,null,null,null,null,null,null,null,null,null,null,null,null,null,null,3780,"Ládbesenyő","Borsod-Abaúj-Zemplén"]
[null,null,null,null,null,null,null,null,null,null,null,null,null,null,null,null,null,null,null,null,8136,"Lajoskomárom","Fejér"]
[null,null,null,null,null,null,null,null,null,null,null,null,null,null,null,null,null,null,null,null,6050,"Lajosmizse","Bács-Kiskun"]
[null,null,null,null,null,null,null,null,null,null,null,null,null,null,null,null,null,null,null,null,3786,"Lak","Borsod-Abaúj-Zemplén"]
[null,null,null,null,null,null,null,null,null,null,null,null,null,null,null,null,null,null,null,null,8913,"Lakhegy","Zala"]
[null,null,null,null,null,null,null,null,null,null,null,null,null,null,null,null,null,null,null,null,6065,"Lakitelek","Bács-Kiskun"]
[null,null,null,null,null,null,null,null,null,null,null,null,null,null,null,null,null,null,null,null,7918,"Lakócsa","Somogy"]
[null,null,null,null,null,null,null,null,null,null,null,null,null,null,null,null,null,null,null,null,7759,"Lánycsók","Baranya"]
[null,null,null,null,null,null,null,null,null,null,null,null,null,null,null,null,null,null,null,null,7214,"Lápafő","Tolna"]
[null,null,null,null,null,null,null,null,null,null,null,null,null,null,null,null,null,null,null,null,7775,"Lapáncsa","Baranya"]
[null,null,null,null,null,null,null,null,null,null,null,null,null,null,null,null,null,null,null,null,4543,"Laskod","Szabolcs-Szatmár-Bereg"]
[null,null,null,null,null,null,null,null,null,null,null,null,null,null,null,null,null,null,null,null,8887,"Lasztonya","Zala"]
[null,null,null,null,null,null,null,null,null,null,null,null,null,null,null,null,null,null,null,null,8681,"Látrány","Somogy"]
[null,null,null,null,null,null,null,null,null,null,null,null,null,null,null,null,null,null,null,null,9089,"Lázi","Győr-Moson-Sopron"]
[null,null,null,null,null,null,null,null,null,null,null,null,null,null,null,null,null,null,null,null,2016,"Leányfalu","Pest"]
[null,null,null,null,null,null,null,null,null,null,null,null,null,null,null,null,null,null,null,null,2518,"Leányvár","Komárom-Esztergom"]
[null,null,null,null,null,null,null,null,null,null,null,null,null,null,null,null,null,null,null,null,9155,"Lébény","Győr-Moson-Sopron"]
[null,null,null,null,null,null,null,null,null,null,null,null,null,null,null,null,null,null,null,null,2619,"Legénd","Nógrád"]
[null,null,null,null,null,null,null,null,null,null,null,null,null,null,null,null,null,null,null,null,3904,"Legyesbénye","Borsod-Abaúj-Zemplén"]
[null,null,null,null,null,null,null,null,null,null,null,null,null,null,null,null,null,null,null,null,3832,"Léh","Borsod-Abaúj-Zemplén"]
[null,null,null,null,null,null,null,null,null,null,null,null,null,null,null,null,null,null,null,null,3648,"Lénárddaróc","Borsod-Abaúj-Zemplén"]
[null,null,null,null,null,null,null,null,null,null,null,null,null,null,null,null,null,null,null,null,8978,"Lendvadedes","Zala"]
[null,null,null,null,null,null,null,null,null,null,null,null,null,null,null,null,null,null,null,null,8977,"Lendvajakabfa","Zala"]
[null,null,null,null,null,null,null,null,null,null,null,null,null,null,null,null,null,null,null,null,7184,"Lengyel","Tolna"]
[null,null,null,null,null,null,null,null,null,null,null,null,null,null,null,null,null,null,null,null,8693,"Lengyeltóti","Somogy"]
[null,null,null,null,null,null,null,null,null,null,null,null,null,null,null,null,null,null,null,null,8966,"Lenti","Zala"]
[null,null,null,null,null,null,null,null,null,null,null,null,null,null,null,null,null,null,null,null,8960,"Lenti","Zala"]
[null,null,null,null,null,null,null,null,null,null,null,null,null,null,null,null,null,null,null,null,8132,"Lepsény","Fejér"]
[null,null,null,null,null,null,null,null,null,null,null,null,null,null,null,null,null,null,null,null,8318,"Lesencefalu","Veszprém"]
[null,null,null,null,null,null,null,null,null,null,null,null,null,null,null,null,null,null,null,null,8319,"Lesenceistvánd","Veszprém"]
[null,null,null,null,null,null,null,null,null,null,null,null,null,null,null,null,null,null,null,null,8318,"Lesencetomaj","Veszprém"]
[null,null,null,null,null,null,null,null,null,null,null,null,null,null,null,null,null,null,null,null,4281,"Létavértes","Hajdú-Bihar"]
[null,null,null,null,null,null,null,null,null,null,null,null,null,null,null,null,null,null,null,null,4283,"Létavértes","Hajdú-Bihar"]
[null,null,null,null,null,null,null,null,null,null,null,null,null,null,null,null,null,null,null,null,8868,"Letenye","Zala"]
[null,null,null,null,null,null,null,null,null,null,null,null,null,null,null,null,null,null,null,null,2632,"Letkés","Pest"]
[null,null,null,null,null,null,null,null,null,null,null,null,null,null,null,null,null,null,null,null,9221,"Levél","Győr-Moson-Sopron"]
[null,null,null,null,null,null,null,null,null,null,null,null,null,null,null,null,null,null,null,null,4555,"Levelek","Szabolcs-Szatmár-Bereg"]
[null,null,null,null,null,null,null,null,null,null,null,null,null,null,null,null,null,null,null,null,8707,"Libickozma","Somogy"]
[null,null,null,null,null,null,null,null,null,null,null,null,null,null,null,null,null,null,null,null,8981,"Lickóvadamos","Zala"]
[null,null,null,null,null,null,null,null,null,null,null,null,null,null,null,null,null,null,null,null,7331,"Liget","Baranya"]
[null,null,null,null,null,null,null,null,null,null,null,null,null,null,null,null,null,null,null,null,8782,"Ligetfalva","Zala"]
[null,null,null,null,null,null,null,null,null,null,null,null,null,null,null,null,null,null,null,null,9233,"Lipót","Győr-Moson-Sopron"]
[null,null,null,null,null,null,null,null,null,null,null,null,null,null,null,null,null,null,null,null,7781,"Lippó","Baranya"]
[null,null,null,null,null,null,null,null,null,null,null,null,null,null,null,null,null,null,null,null,7757,"Liptód","Baranya"]
[null,null,null,null,null,null,null,null,null,null,null,null,null,null,null,null,null,null,null,null,8888,"Lispeszentadorján","Zala"]
[null,null,null,null,null,null,null,null,null,null,null,null,null,null,null,null,null,null,null,null,8831,"Liszó","Zala"]
[null,null,null,null,null,null,null,null,null,null,null,null,null,null,null,null,null,null,null,null,8196,"Litér","Veszprém"]
[null,null,null,null,null,null,null,null,null,null,null,null,null,null,null,null,null,null,null,null,3866,"Litka","Borsod-Abaúj-Zemplén"]
[null,null,null,null,null,null,null,null,null,null,null,null,null,null,null,null,null,null,null,null,3186,"Litke","Nógrád"]
[null,null,null,null,null,null,null,null,null,null,null,null,null,null,null,null,null,null,null,null,9634,"Lócs","Vas"]
[null,null,null,null,null,null,null,null,null,null,null,null,null,null,null,null,null,null,null,null,5743,"Lőkösháza","Veszprém"]
[null,null,null,null,null,null,null,null,null,null,null,null,null,null,null,null,null,null,null,null,8425,"Lókút","Szabolcs-Szatmár-Bereg"]
[null,null,null,null,null,null,null,null,null,null,null,null,null,null,null,null,null,null,null,null,4836,"Lónya","Pest"]
[null,null,null,null,null,null,null,null,null,null,null,null,null,null,null,null,null,null,null,null,2309,"Lórév","Baranya"]
[null,null,null,null,null,null,null,null,null,null,null,null,null,null,null,null,null,null,null,null,3022,"Lőrinci","Veszprém"]
[null,null,null,null,null,null,null,null,null,null,null,null,null,null,null,null,null,null,null,null,3024,"Lőrinci","Fejér"]
[null,null,null,null,null,null,null,null,null,null,null,null,null,null,null,null,null,null,null,null,3021,"Lőrinci","Baranya"]
[null,null,null,null,null,null,null,null,null,null,null,null,null,null,null,null,null,null,null,null,7761,"Lothárd","Zala"]
[null,null,null,null,null,null,null,null,null,null,null,null,null,null,null,null,null,null,null,null,8228,"Lovas","Veszprém"]
[null,null,null,null,null,null,null,null,null,null,null,null,null,null,null,null,null,null,null,null,8093,"Lovasberény","Békés"]
[null,null,null,null,null,null,null,null,null,null,null,null,null,null,null,null,null,null,null,null,7720,"Lovászhetény","Heves"]
[null,null,null,null,null,null,null,null,null,null,null,null,null,null,null,null,null,null,null,null,8878,"Lovászi","Heves"]
[null,null,null,null,null,null,null,null,null,null,null,null,null,null,null,null,null,null,null,null,8553,"Lovászpatona","Heves"]
[null,null,null,null,null,null,null,null,null,null,null,null,null,null,null,null,null,null,null,null,9461,"Lövő","Győr-Moson-Sopron"]
[null,null,null,null,null,null,null,null,null,null,null,null,null,null,null,null,null,null,null,null,4633,"Lövőpetri","Szabolcs-Szatmár-Bereg"]
[null,null,null,null,null,null,null,null,null,null,null,null,null,null,null,null,null,null,null,null,3129,"Lucfalva","Nógrád"]
[null,null,null,null,null,null,null,null,null,null,null,null,null,null,null,null,null,null,null,null,3188,"Ludányhalászi","Nógrád"]
[null,null,null,null,null,null,null,null,null,null,null,null,null,null,null,null,null,null,null,null,3274,"Ludas","Heves"]
[null,null,null,null,null,null,null,null,null,null,null,null,null,null,null,null,null,null,null,null,9724,"Lukácsháza","Vas"]
[null,null,null,null,null,null,null,null,null,null,null,null,null,null,null,null,null,null,null,null,8660,"Lulla","Somogy"]
[null,null,null,null,null,null,null,null,null,null,null,null,null,null,null,null,null,null,null,null,7838,"Lúzsok","Baranya"]
[null,null,null,null,null,null,null,null,null,null,null,null,null,null,null,null,null,null,null,null,3909,"Mád","Borsod-Abaúj-Zemplén"]
[null,null,null,null,null,null,null,null,null,null,null,null,null,null,null,null,null,null,null,null,6456,"Madaras","Bács-Kiskun"]
[null,null,null,null,null,null,null,null,null,null,null,null,null,null,null,null,null,null,null,null,7026,"Madocsa","Tolna"]
[null,null,null,null,null,null,null,null,null,null,null,null,null,null,null,null,null,null,null,null,9169,"Maglóca","Győr-Moson-Sopron"]
[null,null,null,null,null,null,null,null,null,null,null,null,null,null,null,null,null,null,null,null,2234,"Maglód","Pest"]
[null,null,null,null,null,null,null,null,null,null,null,null,null,null,null,null,null,null,null,null,7342,"Mágocs","Baranya"]
[null,null,null,null,null,null,null,null,null,null,null,null,null,null,null,null,null,null,null,null,4953,"Magosliget","Szabolcs-Szatmár-Bereg"]
[null,null,null,null,null,null,null,null,null,null,null,null,null,null,null,null,null,null,null,null,4556,"Magy","Szabolcs-Szatmár-Bereg"]
[null,null,null,null,null,null,null,null,null,null,null,null,null,null,null,null,null,null,null,null,8071,"Magyaralmás","Fejér"]
[null,null,null,null,null,null,null,null,null,null,null,null,null,null,null,null,null,null,null,null,7463,"Magyaratád","Somogy"]
[null,null,null,null,null,null,null,null,null,null,null,null,null,null,null,null,null,null,null,null,5667,"Magyarbánhegyes","Békés"]
[null,null,null,null,null,null,null,null,null,null,null,null,null,null,null,null,null,null,null,null,7775,"Magyarbóly","Baranya"]
[null,null,null,null,null,null,null,null,null,null,null,null,null,null,null,null,null,null,null,null,6932,"Magyarcsanád","Csongrád"]
[null,null,null,null,null,null,null,null,null,null,null,null,null,null,null,null,null,null,null,null,5838,"Magyardombegyház","Békés"]
[null,null,null,null,null,null,null,null,null,null,null,null,null,null,null,null,null,null,null,null,7332,"Magyaregregy","Baranya"]
[null,null,null,null,null,null,null,null,null,null,null,null,null,null,null,null,null,null,null,null,7441,"Magyaregres","Somogy"]
[null,null,null,null,null,null,null,null,null,null,null,null,null,null,null,null,null,null,null,null,8973,"Magyarföld","Zala"]
[null,null,null,null,null,null,null,null,null,null,null,null,null,null,null,null,null,null,null,null,3133,"Magyargéc","Nógrád"]
[null,null,null,null,null,null,null,null,null,null,null,null,null,null,null,null,null,null,null,null,8517,"Magyargencs","Veszprém"]
[null,null,null,null,null,null,null,null,null,null,null,null,null,null,null,null,null,null,null,null,7394,"Magyarhertelend","Baranya"]
[null,null,null,null,null,null,null,null,null,null,null,null,null,null,null,null,null,null,null,null,4137,"Magyarhomorog","Hajdú-Bihar"]
[null,null,null,null,null,null,null,null,null,null,null,null,null,null,null,null,null,null,null,null,9346,"Magyarkeresztúr","Győr-Moson-Sopron"]
[null,null,null,null,null,null,null,null,null,null,null,null,null,null,null,null,null,null,null,null,7098,"Magyarkeszi","Tolna"]
[null,null,null,null,null,null,null,null,null,null,null,null,null,null,null,null,null,null,null,null,9962,"Magyarlak","Vas"]
[null,null,null,null,null,null,null,null,null,null,null,null,null,null,null,null,null,null,null,null,7925,"Magyarlukafa","Baranya"]
[null,null,null,null,null,null,null,null,null,null,null,null,null,null,null,null,null,null,null,null,7954,"Magyarmecske","Baranya"]
[null,null,null,null,null,null,null,null,null,null,null,null,null,null,null,null,null,null,null,null,9909,"Magyarnádalja","Vas"]
[null,null,null,null,null,null,null,null,null,null,null,null,null,null,null,null,null,null,null,null,2694,"Magyarnándor","Nógrád"]
[null,null,null,null,null,null,null,null,null,null,null,null,null,null,null,null,null,null,null,null,8449,"Magyarpolány","Veszprém"]
[null,null,null,null,null,null,null,null,null,null,null,null,null,null,null,null,null,null,null,null,7761,"Magyarsarlós","Baranya"]
[null,null,null,null,null,null,null,null,null,null,null,null,null,null,null,null,null,null,null,null,9912,"Magyarszecsőd","Vas"]
[null,null,null,null,null,null,null,null,null,null,null,null,null,null,null,null,null,null,null,null,7396,"Magyarszék","Baranya"]
[null,null,null,null,null,null,null,null,null,null,null,null,null,null,null,null,null,null,null,null,8776,"Magyarszentmiklós","Zala"]
[null,null,null,null,null,null,null,null,null,null,null,null,null,null,null,null,null,null,null,null,8776,"Magyarszerdahely","Zala"]
[null,null,null,null,null,null,null,null,null,null,null,null,null,null,null,null,null,null,null,null,9946,"Magyarszombatfa","Vas"]
[null,null,null,null,null,null,null,null,null,null,null,null,null,null,null,null,null,null,null,null,7954,"Magyartelek","Baranya"]
[null,null,null,null,null,null,null,null,null,null,null,null,null,null,null,null,null,null,null,null,2339,"Majosháza","Pest"]
[null,null,null,null,null,null,null,null,null,null,null,null,null,null,null,null,null,null,null,null,7783,"Majs","Baranya"]
[null,null,null,null,null,null,null,null,null,null,null,null,null,null,null,null,null,null,null,null,2322,"Makád","Pest"]
[null,null,null,null,null,null,null,null,null,null,null,null,null,null,null,null,null,null,null,null,3959,"Makkoshotyka","Borsod-Abaúj-Zemplén"]
[null,null,null,null,null,null,null,null,null,null,null,null,null,null,null,null,null,null,null,null,3397,"Maklár","Heves"]
[null,null,null,null,null,null,null,null,null,null,null,null,null,null,null,null,null,null,null,null,6903,"Makó","Csongrád"]
[null,null,null,null,null,null,null,null,null,null,null,null,null,null,null,null,null,null,null,null,6900,"Makó","Csongrád"]
[null,null,null,null,null,null,null,null,null,null,null,null,null,null,null,null,null,null,null,null,8533,"Malomsok","Veszprém"]
[null,null,null,null,null,null,null,null,null,null,null,null,null,null,null,null,null,null,null,null,3434,"Mályi","Borsod-Abaúj-Zemplén"]
[null,null,null,null,null,null,null,null,null,null,null,null,null,null,null,null,null,null,null,null,3645,"Mályinka","Borsod-Abaúj-Zemplén"]
[null,null,null,null,null,null,null,null,null,null,null,null,null,null,null,null,null,null,null,null,4942,"Mánd","Szabolcs-Szatmár-Bereg"]
[null,null,null,null,null,null,null,null,null,null,null,null,null,null,null,null,null,null,null,null,4644,"Mándok","Szabolcs-Szatmár-Bereg"]
[null,null,null,null,null,null,null,null,null,null,null,null,null,null,null,null,null,null,null,null,7304,"Mánfa","Baranya"]
[null,null,null,null,null,null,null,null,null,null,null,null,null,null,null,null,null,null,null,null,2065,"Mány","Fejér"]
[null,null,null,null,null,null,null,null,null,null,null,null,null,null,null,null,null,null,null,null,7733,"Maráza","Baranya"]
[null,null,null,null,null,null,null,null,null,null,null,null,null,null,null,null,null,null,null,null,9534,"Marcalgergelyi","Veszprém"]
[null,null,null,null,null,null,null,null,null,null,null,null,null,null,null,null,null,null,null,null,8714,"Marcali","Somogy"]
[null,null,null,null,null,null,null,null,null,null,null,null,null,null,null,null,null,null,null,null,8709,"Marcali","Somogy"]
[null,null,null,null,null,null,null,null,null,null,null,null,null,null,null,null,null,null,null,null,8700,"Marcali","Somogy"]
[null,null,null,null,null,null,null,null,null,null,null,null,null,null,null,null,null,null,null,null,8531,"Marcaltő","Veszprém"]
[null,null,null,null,null,null,null,null,null,null,null,null,null,null,null,null,null,null,null,null,8532,"Marcaltő","Veszprém"]
[null,null,null,null,null,null,null,null,null,null,null,null,null,null,null,null,null,null,null,null,7817,"Márfa","Baranya"]
[null,null,null,null,null,null,null,null,null,null,null,null,null,null,null,null,null,null,null,null,2527,"Máriahalom","Komárom-Esztergom"]
[null,null,null,null,null,null,null,null,null,null,null,null,null,null,null,null,null,null,null,null,9231,"Máriakálnok","Győr-Moson-Sopron"]
[null,null,null,null,null,null,null,null,null,null,null,null,null,null,null,null,null,null,null,null,7663,"Máriakéménd","Baranya"]
[null,null,null,null,null,null,null,null,null,null,null,null,null,null,null,null,null,null,null,null,2629,"Márianosztra","Pest"]
[null,null,null,null,null,null,null,null,null,null,null,null,null,null,null,null,null,null,null,null,4326,"Máriapócs","Szabolcs-Szatmár-Bereg"]
[null,null,null,null,null,null,null,null,null,null,null,null,null,null,null,null,null,null,null,null,3262,"Markaz","Heves"]
[null,null,null,null,null,null,null,null,null,null,null,null,null,null,null,null,null,null,null,null,3075,"Márkháza","Nógrád"]
[null,null,null,null,null,null,null,null,null,null,null,null,null,null,null,null,null,null,null,null,8441,"Márkó","Veszprém"]
[null,null,null,null,null,null,null,null,null,null,null,null,null,null,null,null,null,null,null,null,7967,"Markóc","Baranya"]
[null,null,null,null,null,null,null,null,null,null,null,null,null,null,null,null,null,null,null,null,9164,"Markotabödöge","Győr-Moson-Sopron"]
[null,null,null,null,null,null,null,null,null,null,null,null,null,null,null,null,null,null,null,null,8888,"Maróc","Zala"]
[null,null,null,null,null,null,null,null,null,null,null,null,null,null,null,null,null,null,null,null,7960,"Marócsa","Baranya"]
[null,null,null,null,null,null,null,null,null,null,null,null,null,null,null,null,null,null,null,null,7774,"Márok","Baranya"]
[null,null,null,null,null,null,null,null,null,null,null,null,null,null,null,null,null,null,null,null,8976,"Márokföld","Zala"]
[null,null,null,null,null,null,null,null,null,null,null,null,null,null,null,null,null,null,null,null,4932,"Márokpapi","Szabolcs-Szatmár-Bereg"]
[null,null,null,null,null,null,null,null,null,null,null,null,null,null,null,null,null,null,null,null,6921,"Maroslele","Csongrád"]
[null,null,null,null,null,null,null,null,null,null,null,null,null,null,null,null,null,null,null,null,6636,"Mártély","Csongrád"]
[null,null,null,null,null,null,null,null,null,null,null,null,null,null,null,null,null,null,null,null,5435,"Martfű","Jász-Nagykun-Szolnok"]
[null,null,null,null,null,null,null,null,null,null,null,null,null,null,null,null,null,null,null,null,7720,"Martonfa","Baranya"]
[null,null,null,null,null,null,null,null,null,null,null,null,null,null,null,null,null,null,null,null,2462,"Martonvásár","Fejér"]
[null,null,null,null,null,null,null,null,null,null,null,null,null,null,null,null,null,null,null,null,3755,"Martonyi","Borsod-Abaúj-Zemplén"]
[null,null,null,null,null,null,null,null,null,null,null,null,null,null,null,null,null,null,null,null,4700,"Mátészalka","Szabolcs-Szatmár-Bereg"]
[null,null,null,null,null,null,null,null,null,null,null,null,null,null,null,null,null,null,null,null,6452,"Mátételke","Bács-Kiskun"]
[null,null,null,null,null,null,null,null,null,null,null,null,null,null,null,null,null,null,null,null,3247,"Mátraballa","Heves"]
[null,null,null,null,null,null,null,null,null,null,null,null,null,null,null,null,null,null,null,null,3246,"Mátraderecske","Heves"]
[null,null,null,null,null,null,null,null,null,null,null,null,null,null,null,null,null,null,null,null,3155,"Mátramindszent","Nógrád"]
[null,null,null,null,null,null,null,null,null,null,null,null,null,null,null,null,null,null,null,null,3144,"Mátranovák","Nógrád"]
[null,null,null,null,null,null,null,null,null,null,null,null,null,null,null,null,null,null,null,null,3143,"Mátranovák","Nógrád"]
[null,null,null,null,null,null,null,null,null,null,null,null,null,null,null,null,null,null,null,null,3142,"Mátraszele","Nógrád"]
[null,null,null,null,null,null,null,null,null,null,null,null,null,null,null,null,null,null,null,null,3234,"Mátraszentimre","Heves"]
[null,null,null,null,null,null,null,null,null,null,null,null,null,null,null,null,null,null,null,null,3235,"Mátraszentimre","Heves"]
[null,null,null,null,null,null,null,null,null,null,null,null,null,null,null,null,null,null,null,null,3068,"Mátraszőlős","Nógrád"]
[null,null,null,null,null,null,null,null,null,null,null,null,null,null,null,null,null,null,null,null,3145,"Mátraterenye","Nógrád"]
[null,null,null,null,null,null,null,null,null,null,null,null,null,null,null,null,null,null,null,null,3146,"Mátraterenye","Nógrád"]
[null,null,null,null,null,null,null,null,null,null,null,null,null,null,null,null,null,null,null,null,3077,"Mátraverebély","Nógrád"]
[null,null,null,null,null,null,null,null,null,null,null,null,null,null,null,null,null,null,null,null,7854,"Matty","Fejér"]
[null,null,null,null,null,null,null,null,null,null,null,null,null,null,null,null,null,null,null,null,8134,"Mátyásdomb","Baranya"]
[null,null,null,null,null,null,null,null,null,null,null,null,null,null,null,null,null,null,null,null,4835,"Mátyus","Szabolcs-Szatmár-Bereg"]
[null,null,null,null,null,null,null,null,null,null,null,null,null,null,null,null,null,null,null,null,7351,"Máza","Baranya"]
[null,null,null,null,null,null,null,null,null,null,null,null,null,null,null,null,null,null,null,null,7695,"Mecseknádasd","Baranya"]
[null,null,null,null,null,null,null,null,null,null,null,null,null,null,null,null,null,null,null,null,7300,"Mecsekpölöske","Baranya"]
[null,null,null,null,null,null,null,null,null,null,null,null,null,null,null,null,null,null,null,null,9176,"Mecsér","Győr-Moson-Sopron"]
[null,null,null,null,null,null,null,null,null,null,null,null,null,null,null,null,null,null,null,null,5664,"Medgyesbodzás","Békés"]
[null,null,null,null,null,null,null,null,null,null,null,null,null,null,null,null,null,null,null,null,5663,"Medgyesbodzás","Békés"]
[null,null,null,null,null,null,null,null,null,null,null,null,null,null,null,null,null,null,null,null,5752,"Medgyesegyháza","Békés"]
[null,null,null,null,null,null,null,null,null,null,null,null,null,null,null,null,null,null,null,null,5666,"Medgyesegyháza","Békés"]
[null,null,null,null,null,null,null,null,null,null,null,null,null,null,null,null,null,null,null,null,7057,"Medina","Tolna"]
[null,null,null,null,null,null,null,null,null,null,null,null,null,null,null,null,null,null,null,null,9757,"Meggyeskovácsi","Vas"]
[null,null,null,null,null,null,null,null,null,null,null,null,null,null,null,null,null,null,null,null,3718,"Megyaszó","Borsod-Abaúj-Zemplén"]
[null,null,null,null,null,null,null,null,null,null,null,null,null,null,null,null,null,null,null,null,9754,"Megyehid","Vas"]
[null,null,null,null,null,null,null,null,null,null,null,null,null,null,null,null,null,null,null,null,8348,"Megyer","Veszprém"]
[null,null,null,null,null,null,null,null,null,null,null,null,null,null,null,null,null,null,null,null,5726,"Méhkerék","Békés"]
[null,null,null,null,null,null,null,null,null,null,null,null,null,null,null,null,null,null,null,null,4975,"Méhtelek","Szabolcs-Szatmár-Bereg"]
[null,null,null,null,null,null,null,null,null,null,null,null,null,null,null,null,null,null,null,null,7344,"Mekényes","Baranya"]
[null,null,null,null,null,null,null,null,null,null,null,null,null,null,null,null,null,null,null,null,6449,"Mélykút","Bács-Kiskun"]
[null,null,null,null,null,null,null,null,null,null,null,null,null,null,null,null,null,null,null,null,8271,"Mencshely","Veszprém"]
[null,null,null,null,null,null,null,null,null,null,null,null,null,null,null,null,null,null,null,null,2235,"Mende","Pest"]
[null,null,null,null,null,null,null,null,null,null,null,null,null,null,null,null,null,null,null,null,3871,"Méra","Borsod-Abaúj-Zemplén"]
[null,null,null,null,null,null,null,null,null,null,null,null,null,null,null,null,null,null,null,null,7981,"Merenye","Baranya"]
[null,null,null,null,null,null,null,null,null,null,null,null,null,null,null,null,null,null,null,null,9136,"Mérges","Győr-Moson-Sopron"]
[null,null,null,null,null,null,null,null,null,null,null,null,null,null,null,null,null,null,null,null,4352,"Mérk","Szabolcs-Szatmár-Bereg"]
[null,null,null,null,null,null,null,null,null,null,null,null,null,null,null,null,null,null,null,null,7453,"Mernye","Somogy"]
[null,null,null,null,null,null,null,null,null,null,null,null,null,null,null,null,null,null,null,null,9531,"Mersevát","Vas"]
[null,null,null,null,null,null,null,null,null,null,null,null,null,null,null,null,null,null,null,null,9662,"Mesterháza","Vas"]
[null,null,null,null,null,null,null,null,null,null,null,null,null,null,null,null,null,null,null,null,9551,"Mesteri","Vas"]
[null,null,null,null,null,null,null,null,null,null,null,null,null,null,null,null,null,null,null,null,5452,"Mesterszállás","Jász-Nagykun-Szolnok"]
[null,null,null,null,null,null,null,null,null,null,null,null,null,null,null,null,null,null,null,null,3754,"Meszes","Borsod-Abaúj-Zemplén"]
[null,null,null,null,null,null,null,null,null,null,null,null,null,null,null,null,null,null,null,null,9745,"Meszlen","Vas"]
[null,null,null,null,null,null,null,null,null,null,null,null,null,null,null,null,null,null,null,null,8716,"Mesztegnyő","Somogy"]
[null,null,null,null,null,null,null,null,null,null,null,null,null,null,null,null,null,null,null,null,5650,"Mezőberény","Békés"]
[null,null,null,null,null,null,null,null,null,null,null,null,null,null,null,null,null,null,null,null,3450,"Mezőcsát","Borsod-Abaúj-Zemplén"]
[null,null,null,null,null,null,null,null,null,null,null,null,null,null,null,null,null,null,null,null,7434,"Mezőcsokonya","Somogy"]
[null,null,null,null,null,null,null,null,null,null,null,null,null,null,null,null,null,null,null,null,7370,"Meződ","Baranya"]
[null,null,null,null,null,null,null,null,null,null,null,null,null,null,null,null,null,null,null,null,2422,"Mezőfalva","Fejér"]
[null,null,null,null,null,null,null,null,null,null,null,null,null,null,null,null,null,null,null,null,5732,"Mezőgyán","Békés"]
[null,null,null,null,null,null,null,null,null,null,null,null,null,null,null,null,null,null,null,null,5820,"Mezőhegyes","Békés"]
[null,null,null,null,null,null,null,null,null,null,null,null,null,null,null,null,null,null,null,null,5453,"Mezőhék","Jász-Nagykun-Szolnok"]
[null,null,null,null,null,null,null,null,null,null,null,null,null,null,null,null,null,null,null,null,3441,"Mezőkeresztes","Borsod-Abaúj-Zemplén"]
[null,null,null,null,null,null,null,null,null,null,null,null,null,null,null,null,null,null,null,null,8137,"Mezőkomárom","Fejér"]
[null,null,null,null,null,null,null,null,null,null,null,null,null,null,null,null,null,null,null,null,5800,"Mezőkovácsháza","Békés"]
[null,null,null,null,null,null,null,null,null,null,null,null,null,null,null,null,null,null,null,null,3400,"Mezőkövesd","Borsod-Abaúj-Zemplén"]
[null,null,null,null,null,null,null,null,null,null,null,null,null,null,null,null,null,null,null,null,4641,"Mezőladány","Szabolcs-Szatmár-Bereg"]
[null,null,null,null,null,null,null,null,null,null,null,null,null,null,null,null,null,null,null,null,8514,"Mezőlak","Veszprém"]
[null,null,null,null,null,null,null,null,null,null,null,null,null,null,null,null,null,null,null,null,3443,"Mezőnagymihály","Borsod-Abaúj-Zemplén"]
[null,null,null,null,null,null,null,null,null,null,null,null,null,null,null,null,null,null,null,null,3421,"Mezőnyárád","Borsod-Abaúj-Zemplén"]
[null,null,null,null,null,null,null,null,null,null,null,null,null,null,null,null,null,null,null,null,9098,"Mezőörs","Győr-Moson-Sopron"]
[null,null,null,null,null,null,null,null,null,null,null,null,null,null,null,null,null,null,null,null,9097,"Mezőörs","Győr-Moson-Sopron"]
[null,null,null,null,null,null,null,null,null,null,null,null,null,null,null,null,null,null,null,null,4118,"Mezőpeterd","Hajdú-Bihar"]
[null,null,null,null,null,null,null,null,null,null,null,null,null,null,null,null,null,null,null,null,4134,"Mezősas","Hajdú-Bihar"]
[null,null,null,null,null,null,null,null,null,null,null,null,null,null,null,null,null,null,null,null,3378,"Mezőszemere","Heves"]
[null,null,null,null,null,null,null,null,null,null,null,null,null,null,null,null,null,null,null,null,8133,"Mezőszentgyörgy","Fejér"]
[null,null,null,null,null,null,null,null,null,null,null,null,null,null,null,null,null,null,null,null,7017,"Mezőszilas","Fejér"]
[null,null,null,null,null,null,null,null,null,null,null,null,null,null,null,null,null,null,null,null,3375,"Mezőtárkány","Heves"]
[null,null,null,null,null,null,null,null,null,null,null,null,null,null,null,null,null,null,null,null,5400,"Mezőtúr","Jász-Nagykun-Szolnok"]
[null,null,null,null,null,null,null,null,null,null,null,null,null,null,null,null,null,null,null,null,3931,"Mezőzombor","Borsod-Abaúj-Zemplén"]
[null,null,null,null,null,null,null,null,null,null,null,null,null,null,null,null,null,null,null,null,8825,"Miháld","Zala"]
[null,null,null,null,null,null,null,null,null,null,null,null,null,null,null,null,null,null,null,null,8341,"Mihályfa","Zala"]
[null,null,null,null,null,null,null,null,null,null,null,null,null,null,null,null,null,null,null,null,3184,"Mihálygerge","Nógrád"]
[null,null,null,null,null,null,null,null,null,null,null,null,null,null,null,null,null,null,null,null,8513,"Mihályháza","Veszprém"]
[null,null,null,null,null,null,null,null,null,null,null,null,null,null,null,null,null,null,null,null,9342,"Mihályi","Győr-Moson-Sopron"]
[null,null,null,null,null,null,null,null,null,null,null,null,null,null,null,null,null,null,null,null,7512,"Mike","Somogy"]
[null,null,null,null,null,null,null,null,null,null,null,null,null,null,null,null,null,null,null,null,2736,"Mikebuda","Pest"]
[null,null,null,null,null,null,null,null,null,null,null,null,null,null,null,null,null,null,null,null,8949,"Mikekarácsonyfa","Zala"]
[null,null,null,null,null,null,null,null,null,null,null,null,null,null,null,null,null,null,null,null,4271,"Mikepércs","Hajdú-Bihar"]
[null,null,null,null,null,null,null,null,null,null,null,null,null,null,null,null,null,null,null,null,7286,"Miklósi","Somogy"]
[null,null,null,null,null,null,null,null,null,null,null,null,null,null,null,null,null,null,null,null,3344,"Mikófalva","Heves"]
[null,null,null,null,null,null,null,null,null,null,null,null,null,null,null,null,null,null,null,null,3989,"Mikóháza","Borsod-Abaúj-Zemplén"]
[null,null,null,null,null,null,null,null,null,null,null,null,null,null,null,null,null,null,null,null,9835,"Mikosszéplak","Vas"]
[null,null,null,null,null,null,null,null,null,null,null,null,null,null,null,null,null,null,null,null,8917,"Milejszeg","Zala"]
[null,null,null,null,null,null,null,null,null,null,null,null,null,null,null,null,null,null,null,null,4948,"Milota","Szabolcs-Szatmár-Bereg"]
[null,null,null,null,null,null,null,null,null,null,null,null,null,null,null,null,null,null,null,null,6630,"Mindszent","Csongrád"]
[null,null,null,null,null,null,null,null,null,null,null,null,null,null,null,null,null,null,null,null,7391,"Mindszentgodisa","Baranya"]
[null,null,null,null,null,null,null,null,null,null,null,null,null,null,null,null,null,null,null,null,8282,"Mindszentkálla","Veszprém"]
[null,null,null,null,null,null,null,null,null,null,null,null,null,null,null,null,null,null,null,null,8935,"Misefa","Zala"]
[null,null,null,null,null,null,null,null,null,null,null,null,null,null,null,null,null,null,null,null,6343,"Miske","Bács-Kiskun"]
[null,null,null,null,null,null,null,null,null,null,null,null,null,null,null,null,null,null,null,null,3510,"Miskolc","Borsod-Abaúj-Zemplén"]
[null,null,null,null,null,null,null,null,null,null,null,null,null,null,null,null,null,null,null,null,3515,"Miskolc","Borsod-Abaúj-Zemplén"]
[null,null,null,null,null,null,null,null,null,null,null,null,null,null,null,null,null,null,null,null,3516,"Miskolc","Borsod-Abaúj-Zemplén"]
[null,null,null,null,null,null,null,null,null,null,null,null,null,null,null,null,null,null,null,null,3508,"Miskolc","Borsod-Abaúj-Zemplén"]
[null,null,null,null,null,null,null,null,null,null,null,null,null,null,null,null,null,null,null,null,3517,"Miskolc","Borsod-Abaúj-Zemplén"]
[null,null,null,null,null,null,null,null,null,null,null,null,null,null,null,null,null,null,null,null,3518,"Miskolc","Borsod-Abaúj-Zemplén"]
[null,null,null,null,null,null,null,null,null,null,null,null,null,null,null,null,null,null,null,null,3521,"Miskolc","Borsod-Abaúj-Zemplén"]
[null,null,null,null,null,null,null,null,null,null,null,null,null,null,null,null,null,null,null,null,3519,"Miskolc","Borsod-Abaúj-Zemplén"]
[null,null,null,null,null,null,null,null,null,null,null,null,null,null,null,null,null,null,null,null,3500,"Miskolc","Borsod-Abaúj-Zemplén"]
[null,null,null,null,null,null,null,null,null,null,null,null,null,null,null,null,null,null,null,null,3501,"Miskolc","Borsod-Abaúj-Zemplén"]
[null,null,null,null,null,null,null,null,null,null,null,null,null,null,null,null,null,null,null,null,3524,"Miskolc","Borsod-Abaúj-Zemplén"]
[null,null,null,null,null,null,null,null,null,null,null,null,null,null,null,null,null,null,null,null,3525,"Miskolc","Borsod-Abaúj-Zemplén"]
[null,null,null,null,null,null,null,null,null,null,null,null,null,null,null,null,null,null,null,null,3526,"Miskolc","Borsod-Abaúj-Zemplén"]
[null,null,null,null,null,null,null,null,null,null,null,null,null,null,null,null,null,null,null,null,3527,"Miskolc","Borsod-Abaúj-Zemplén"]
[null,null,null,null,null,null,null,null,null,null,null,null,null,null,null,null,null,null,null,null,3528,"Miskolc","Borsod-Abaúj-Zemplén"]
[null,null,null,null,null,null,null,null,null,null,null,null,null,null,null,null,null,null,null,null,3529,"Miskolc","Borsod-Abaúj-Zemplén"]
[null,null,null,null,null,null,null,null,null,null,null,null,null,null,null,null,null,null,null,null,3530,"Miskolc","Borsod-Abaúj-Zemplén"]
[null,null,null,null,null,null,null,null,null,null,null,null,null,null,null,null,null,null,null,null,3531,"Miskolc","Borsod-Abaúj-Zemplén"]
[null,null,null,null,null,null,null,null,null,null,null,null,null,null,null,null,null,null,null,null,3532,"Miskolc","Borsod-Abaúj-Zemplén"]
[null,null,null,null,null,null,null,null,null,null,null,null,null,null,null,null,null,null,null,null,3533,"Miskolc","Borsod-Abaúj-Zemplén"]
[null,null,null,null,null,null,null,null,null,null,null,null,null,null,null,null,null,null,null,null,3534,"Miskolc","Borsod-Abaúj-Zemplén"]
[null,null,null,null,null,null,null,null,null,null,null,null,null,null,null,null,null,null,null,null,3535,"Miskolc","Borsod-Abaúj-Zemplén"]
[null,null,null,null,null,null,null,null,null,null,null,null,null,null,null,null,null,null,null,null,7065,"Miszla","Tolna"]
[null,null,null,null,null,null,null,null,null,null,null,null,null,null,null,null,null,null,null,null,2911,"Mocsa","Komárom-Esztergom"]
[null,null,null,null,null,null,null,null,null,null,null,null,null,null,null,null,null,null,null,null,7163,"Mőcsény","Pest"]
[null,null,null,null,null,null,null,null,null,null,null,null,null,null,null,null,null,null,null,null,2146,"Mogyoród","Komárom-Esztergom"]
[null,null,null,null,null,null,null,null,null,null,null,null,null,null,null,null,null,null,null,null,2535,"Mogyorósbánya","Borsod-Abaúj-Zemplén"]
[null,null,null,null,null,null,null,null,null,null,null,null,null,null,null,null,null,null,null,null,3893,"Mogyoróska","Fejér"]
[null,null,null,null,null,null,null,null,null,null,null,null,null,null,null,null,null,null,null,null,8042,"Moha","Baranya"]
[null,null,null,null,null,null,null,null,null,null,null,null,null,null,null,null,null,null,null,null,7715,"Mohács","Baranya"]
[null,null,null,null,null,null,null,null,null,null,null,null,null,null,null,null,null,null,null,null,7714,"Mohács","Baranya"]
[null,null,null,null,null,null,null,null,null,null,null,null,null,null,null,null,null,null,null,null,7700,"Mohács","Nógrád"]
[null,null,null,null,null,null,null,null,null,null,null,null,null,null,null,null,null,null,null,null,2698,"Mohora","Zala"]
[null,null,null,null,null,null,null,null,null,null,null,null,null,null,null,null,null,null,null,null,8863,"Molnári","Vas"]
[null,null,null,null,null,null,null,null,null,null,null,null,null,null,null,null,null,null,null,null,9912,"Molnaszecsőd","Baranya"]
[null,null,null,null,null,null,null,null,null,null,null,null,null,null,null,null,null,null,null,null,7981,"Molvány","Borsod-Abaúj-Zemplén"]
[null,null,null,null,null,null,null,null,null,null,null,null,null,null,null,null,null,null,null,null,3812,"Monaj","Borsod-Abaúj-Zemplén"]
[null,null,null,null,null,null,null,null,null,null,null,null,null,null,null,null,null,null,null,null,3905,"Monok","Pest"]
[null,null,null,null,null,null,null,null,null,null,null,null,null,null,null,null,null,null,null,null,2213,"Monor","Pest"]
[null,null,null,null,null,null,null,null,null,null,null,null,null,null,null,null,null,null,null,null,2200,"Monor","Heves"]
[null,null,null,null,null,null,null,null,null,null,null,null,null,null,null,null,null,null,null,null,3345,"Mónosbél","Veszprém"]
[null,null,null,null,null,null,null,null,null,null,null,null,null,null,null,null,null,null,null,null,8296,"Monostorapáti","Hajdú-Bihar"]
[null,null,null,null,null,null,null,null,null,null,null,null,null,null,null,null,null,null,null,null,4275,"Monostorpályi","Veszprém"]
[null,null,null,null,null,null,null,null,null,null,null,null,null,null,null,null,null,null,null,null,8273,"Monoszló","Baranya"]
[null,null,null,null,null,null,null,null,null,null,null,null,null,null,null,null,null,null,null,null,7751,"Monyoród","Fejér"]
[null,null,null,null,null,null,null,null,null,null,null,null,null,null,null,null,null,null,null,null,8060,"Mór","Tolna"]
[null,null,null,null,null,null,null,null,null,null,null,null,null,null,null,null,null,null,null,null,7165,"Mórágy","Csongrád"]
[null,null,null,null,null,null,null,null,null,null,null,null,null,null,null,null,null,null,null,null,6782,"Mórahalom","Bács-Kiskun"]
[null,null,null,null,null,null,null,null,null,null,null,null,null,null,null,null,null,null,null,null,6132,"Móricgát","Győr-Moson-Sopron"]
[null,null,null,null,null,null,null,null,null,null,null,null,null,null,null,null,null,null,null,null,9131,"Mórichida","Somogy"]
[null,null,null,null,null,null,null,null,null,null,null,null,null,null,null,null,null,null,null,null,7257,"Mosdós","Győr-Moson-Sopron"]
[null,null,null,null,null,null,null,null,null,null,null,null,null,null,null,null,null,null,null,null,9200,"Mosonmagyaróvár","Győr-Moson-Sopron"]
[null,null,null,null,null,null,null,null,null,null,null,null,null,null,null,null,null,null,null,null,9183,"Mosonszentmiklós","Győr-Moson-Sopron"]
[null,null,null,null,null,null,null,null,null,null,null,null,null,null,null,null,null,null,null,null,9154,"Mosonszentmiklós","Győr-Moson-Sopron"]
[null,null,null,null,null,null,null,null,null,null,null,null,null,null,null,null,null,null,null,null,9245,"Mosonszolnok","Baranya"]
[null,null,null,null,null,null,null,null,null,null,null,null,null,null,null,null,null,null,null,null,7932,"Mozsgó","Tolna"]
[null,null,null,null,null,null,null,null,null,null,null,null,null,null,null,null,null,null,null,null,7185,"Mucsfa","Tolna"]
[null,null,null,null,null,null,null,null,null,null,null,null,null,null,null,null,null,null,null,null,7195,"Mucsi","Tolna"]
[null,null,null,null,null,null,null,null,null,null,null,null,null,null,null,null,null,null,null,null,3744,"Múcsony","Borsod-Abaúj-Zemplén"]
[null,null,null,null,null,null,null,null,null,null,null,null,null,null,null,null,null,null,null,null,3552,"Muhi","Borsod-Abaúj-Zemplén"]
[null,null,null,null,null,null,null,null,null,null,null,null,null,null,null,null,null,null,null,null,8834,"Murakeresztúr","Zala"]
[null,null,null,null,null,null,null,null,null,null,null,null,null,null,null,null,null,null,null,null,8868,"Murarátka","Zala"]
[null,null,null,null,null,null,null,null,null,null,null,null,null,null,null,null,null,null,null,null,8872,"Muraszemenye","Zala"]
[null,null,null,null,null,null,null,null,null,null,null,null,null,null,null,null,null,null,null,null,7176,"Murga","Tolna"]
[null,null,null,null,null,null,null,null,null,null,null,null,null,null,null,null,null,null,null,null,5672,"Murony","Békés"]
[null,null,null,null,null,null,null,null,null,null,null,null,null,null,null,null,null,null,null,null,4911,"Nábrád","Szabolcs-Szatmár-Bereg"]
[null,null,null,null,null,null,null,null,null,null,null,null,null,null,null,null,null,null,null,null,8097,"Nadap","Fejér"]
[null,null,null,null,null,null,null,null,null,null,null,null,null,null,null,null,null,null,null,null,9915,"Nádasd","Vas"]
[null,null,null,null,null,null,null,null,null,null,null,null,null,null,null,null,null,null,null,null,8145,"Nádasdladány","Fejér"]
[null,null,null,null,null,null,null,null,null,null,null,null,null,null,null,null,null,null,null,null,4181,"Nádudvar","Hajdú-Bihar"]
[null,null,null,null,null,null,null,null,null,null,null,null,null,null,null,null,null,null,null,null,8674,"Nágocs","Somogy"]
[null,null,null,null,null,null,null,null,null,null,null,null,null,null,null,null,null,null,null,null,8521,"Nagyacsád","Veszprém"]
[null,null,null,null,null,null,null,null,null,null,null,null,null,null,null,null,null,null,null,null,8484,"Nagyalásony","Veszprém"]
[null,null,null,null,null,null,null,null,null,null,null,null,null,null,null,null,null,null,null,null,4922,"Nagyar","Szabolcs-Szatmár-Bereg"]
[null,null,null,null,null,null,null,null,null,null,null,null,null,null,null,null,null,null,null,null,7500,"Nagyatád","Somogy"]
[null,null,null,null,null,null,null,null,null,null,null,null,null,null,null,null,null,null,null,null,9063,"Nagybajcs","Győr-Moson-Sopron"]
[null,null,null,null,null,null,null,null,null,null,null,null,null,null,null,null,null,null,null,null,7561,"Nagybajom","Somogy"]
[null,null,null,null,null,null,null,null,null,null,null,null,null,null,null,null,null,null,null,null,8821,"Nagybakónak","Zala"]
[null,null,null,null,null,null,null,null,null,null,null,null,null,null,null,null,null,null,null,null,5668,"Nagybánhegyes","Békés"]
[null,null,null,null,null,null,null,null,null,null,null,null,null,null,null,null,null,null,null,null,6527,"Nagybaracska","Bács-Kiskun"]
[null,null,null,null,null,null,null,null,null,null,null,null,null,null,null,null,null,null,null,null,3641,"Nagybarca","Borsod-Abaúj-Zemplén"]
[null,null,null,null,null,null,null,null,null,null,null,null,null,null,null,null,null,null,null,null,3075,"Nagybárkány","Nógrád"]
[null,null,null,null,null,null,null,null,null,null,null,null,null,null,null,null,null,null,null,null,8656,"Nagyberény","Somogy"]
[null,null,null,null,null,null,null,null,null,null,null,null,null,null,null,null,null,null,null,null,7255,"Nagyberki","Somogy"]
[null,null,null,null,null,null,null,null,null,null,null,null,null,null,null,null,null,null,null,null,2634,"Nagybörzsöny","Pest"]
[null,null,null,null,null,null,null,null,null,null,null,null,null,null,null,null,null,null,null,null,7756,"Nagybudmér","Baranya"]
[null,null,null,null,null,null,null,null,null,null,null,null,null,null,null,null,null,null,null,null,9485,"Nagycenk","Győr-Moson-Sopron"]
[null,null,null,null,null,null,null,null,null,null,null,null,null,null,null,null,null,null,null,null,7838,"Nagycsány","Baranya"]
[null,null,null,null,null,null,null,null,null,null,null,null,null,null,null,null,null,null,null,null,3598,"Nagycsécs","Borsod-Abaúj-Zemplén"]
[null,null,null,null,null,null,null,null,null,null,null,null,null,null,null,null,null,null,null,null,8628,"Nagycsepely","Somogy"]
[null,null,null,null,null,null,null,null,null,null,null,null,null,null,null,null,null,null,null,null,4445,"Nagycserkesz","Szabolcs-Szatmár-Bereg"]
[null,null,null,null,null,null,null,null,null,null,null,null,null,null,null,null,null,null,null,null,8554,"Nagydém","Veszprém"]
[null,null,null,null,null,null,null,null,null,null,null,null,null,null,null,null,null,null,null,null,4823,"Nagydobos","Szabolcs-Szatmár-Bereg"]
[null,null,null,null,null,null,null,null,null,null,null,null,null,null,null,null,null,null,null,null,7985,"Nagydobsza","Baranya"]
[null,null,null,null,null,null,null,null,null,null,null,null,null,null,null,null,null,null,null,null,7044,"Nagydorog","Tolna"]
[null,null,null,null,null,null,null,null,null,null,null,null,null,null,null,null,null,null,null,null,4355,"Nagyecsed","Szabolcs-Szatmár-Bereg"]
[null,null,null,null,null,null,null,null,null,null,null,null,null,null,null,null,null,null,null,null,6917,"Nagyér","Csongrád"]
[null,null,null,null,null,null,null,null,null,null,null,null,null,null,null,null,null,null,null,null,8415,"Nagyesztergár","Veszprém"]
[null,null,null,null,null,null,null,null,null,null,null,null,null,null,null,null,null,null,null,null,3282,"Nagyfüged","Heves"]
[null,null,null,null,null,null,null,null,null,null,null,null,null,null,null,null,null,null,null,null,9664,"Nagygeresd","Vas"]
[null,null,null,null,null,null,null,null,null,null,null,null,null,null,null,null,null,null,null,null,8356,"Nagygörbő","Zala"]
[null,null,null,null,null,null,null,null,null,null,null,null,null,null,null,null,null,null,null,null,8551,"Nagygyimót","Veszprém"]
[null,null,null,null,null,null,null,null,null,null,null,null,null,null,null,null,null,null,null,null,7343,"Nagyhajmás","Baranya"]
[null,null,null,null,null,null,null,null,null,null,null,null,null,null,null,null,null,null,null,null,4485,"Nagyhalász","Szabolcs-Szatmár-Bereg"]
[null,null,null,null,null,null,null,null,null,null,null,null,null,null,null,null,null,null,null,null,7822,"Nagyharsány","Baranya"]
[null,null,null,null,null,null,null,null,null,null,null,null,null,null,null,null,null,null,null,null,4064,"Nagyhegyes","Hajdú-Bihar"]
[null,null,null,null,null,null,null,null,null,null,null,null,null,null,null,null,null,null,null,null,4977,"Nagyhódos","Szabolcs-Szatmár-Bereg"]
[null,null,null,null,null,null,null,null,null,null,null,null,null,null,null,null,null,null,null,null,3994,"Nagyhuta","Borsod-Abaúj-Zemplén"]
[null,null,null,null,null,null,null,null,null,null,null,null,null,null,null,null,null,null,null,null,2942,"Nagyigmánd","Komárom-Esztergom"]
[null,null,null,null,null,null,null,null,null,null,null,null,null,null,null,null,null,null,null,null,5363,"Nagyiván","Jász-Nagykun-Szolnok"]
[null,null,null,null,null,null,null,null,null,null,null,null,null,null,null,null,null,null,null,null,4320,"Nagykálló","Szabolcs-Szatmár-Bereg"]
[null,null,null,null,null,null,null,null,null,null,null,null,null,null,null,null,null,null,null,null,5751,"Nagykamarás","Békés"]
[null,null,null,null,null,null,null,null,null,null,null,null,null,null,null,null,null,null,null,null,8831,"Nagykanizsa","Zala"]
[null,null,null,null,null,null,null,null,null,null,null,null,null,null,null,null,null,null,null,null,8808,"Nagykanizsa","Zala"]
[null,null,null,null,null,null,null,null,null,null,null,null,null,null,null,null,null,null,null,null,8809,"Nagykanizsa","Zala"]
[null,null,null,null,null,null,null,null,null,null,null,null,null,null,null,null,null,null,null,null,8800,"Nagykanizsa","Zala"]
[null,null,null,null,null,null,null,null,null,null,null,null,null,null,null,null,null,null,null,null,8935,"Nagykapornak","Zala"]
[null,null,null,null,null,null,null,null,null,null,null,null,null,null,null,null,null,null,null,null,2425,"Nagykarácsony","Fejér"]
[null,null,null,null,null,null,null,null,null,null,null,null,null,null,null,null,null,null,null,null,2760,"Nagykáta","Pest"]
[null,null,null,null,null,null,null,null,null,null,null,null,null,null,null,null,null,null,null,null,4127,"Nagykereki","Hajdú-Bihar"]
[null,null,null,null,null,null,null,null,null,null,null,null,null,null,null,null,null,null,null,null,3129,"Nagykeresztúr","Nógrád"]
[null,null,null,null,null,null,null,null,null,null,null,null,null,null,null,null,null,null,null,null,3844,"Nagykinizs","Borsod-Abaúj-Zemplén"]
[null,null,null,null,null,null,null,null,null,null,null,null,null,null,null,null,null,null,null,null,3012,"Nagykökényes","Tolna"]
[null,null,null,null,null,null,null,null,null,null,null,null,null,null,null,null,null,null,null,null,9784,"Nagykölked","Somogy"]
[null,null,null,null,null,null,null,null,null,null,null,null,null,null,null,null,null,null,null,null,7092,"Nagykónyi","Pest"]
[null,null,null,null,null,null,null,null,null,null,null,null,null,null,null,null,null,null,null,null,2750,"Nagykőrös","Baranya"]
[null,null,null,null,null,null,null,null,null,null,null,null,null,null,null,null,null,null,null,null,7545,"Nagykorpád","Heves"]
[null,null,null,null,null,null,null,null,null,null,null,null,null,null,null,null,null,null,null,null,5065,"Nagykörű","Vas"]
[null,null,null,null,null,null,null,null,null,null,null,null,null,null,null,null,null,null,null,null,2094,"Nagykovácsi","Pest"]
[null,null,null,null,null,null,null,null,null,null,null,null,null,null,null,null,null,null,null,null,7741,"Nagykozár","Jász-Nagykun-Szolnok"]
[null,null,null,null,null,null,null,null,null,null,null,null,null,null,null,null,null,null,null,null,8911,"Nagykutas","Zala"]
[null,null,null,null,null,null,null,null,null,null,null,null,null,null,null,null,null,null,null,null,6933,"Nagylak","Csongrád"]
[null,null,null,null,null,null,null,null,null,null,null,null,null,null,null,null,null,null,null,null,8983,"Nagylengyel","Zala"]
[null,null,null,null,null,null,null,null,null,null,null,null,null,null,null,null,null,null,null,null,3175,"Nagylóc","Nógrád"]
[null,null,null,null,null,null,null,null,null,null,null,null,null,null,null,null,null,null,null,null,2435,"Nagylók","Fejér"]
[null,null,null,null,null,null,null,null,null,null,null,null,null,null,null,null,null,null,null,null,9482,"Nagylózs","Győr-Moson-Sopron"]
[null,null,null,null,null,null,null,null,null,null,null,null,null,null,null,null,null,null,null,null,6622,"Nagymágocs","Csongrád"]
[null,null,null,null,null,null,null,null,null,null,null,null,null,null,null,null,null,null,null,null,7355,"Nagymányok","Tolna"]
[null,null,null,null,null,null,null,null,null,null,null,null,null,null,null,null,null,null,null,null,2626,"Nagymaros","Pest"]
[null,null,null,null,null,null,null,null,null,null,null,null,null,null,null,null,null,null,null,null,9913,"Nagymizdó","Vas"]
[null,null,null,null,null,null,null,null,null,null,null,null,null,null,null,null,null,null,null,null,7784,"Nagynyárád","Baranya"]
[null,null,null,null,null,null,null,null,null,null,null,null,null,null,null,null,null,null,null,null,2645,"Nagyoroszi","Nógrád"]
[null,null,null,null,null,null,null,null,null,null,null,null,null,null,null,null,null,null,null,null,8912,"Nagypáli","Zala"]
[null,null,null,null,null,null,null,null,null,null,null,null,null,null,null,null,null,null,null,null,7731,"Nagypall","Baranya"]
[null,null,null,null,null,null,null,null,null,null,null,null,null,null,null,null,null,null,null,null,7912,"Nagypeterd","Baranya"]
[null,null,null,null,null,null,null,null,null,null,null,null,null,null,null,null,null,null,null,null,8496,"Nagypirit","Veszprém"]
[null,null,null,null,null,null,null,null,null,null,null,null,null,null,null,null,null,null,null,null,4173,"Nagyrábé","Hajdú-Bihar"]
[null,null,null,null,null,null,null,null,null,null,null,null,null,null,null,null,null,null,null,null,8746,"Nagyrada","Zala"]
[null,null,null,null,null,null,null,null,null,null,null,null,null,null,null,null,null,null,null,null,9938,"Nagyrákos","Vas"]
[null,null,null,null,null,null,null,null,null,null,null,null,null,null,null,null,null,null,null,null,8756,"Nagyrécse","Zala"]
[null,null,null,null,null,null,null,null,null,null,null,null,null,null,null,null,null,null,null,null,3214,"Nagyréde","Heves"]
[null,null,null,null,null,null,null,null,null,null,null,null,null,null,null,null,null,null,null,null,5463,"Nagyrév","Jász-Nagykun-Szolnok"]
[null,null,null,null,null,null,null,null,null,null,null,null,null,null,null,null,null,null,null,null,3965,"Nagyrozvágy","Borsod-Abaúj-Zemplén"]
[null,null,null,null,null,null,null,null,null,null,null,null,null,null,null,null,null,null,null,null,2524,"Nagysáp","Komárom-Esztergom"]
[null,null,null,null,null,null,null,null,null,null,null,null,null,null,null,null,null,null,null,null,9561,"Nagysimonyi","Vas"]
[null,null,null,null,null,null,null,null,null,null,null,null,null,null,null,null,null,null,null,null,8739,"Nagyszakácsi","Somogy"]
[null,null,null,null,null,null,null,null,null,null,null,null,null,null,null,null,null,null,null,null,7085,"Nagyszékely","Tolna"]
[null,null,null,null,null,null,null,null,null,null,null,null,null,null,null,null,null,null,null,null,4962,"Nagyszekeres","Szabolcs-Szatmár-Bereg"]
[null,null,null,null,null,null,null,null,null,null,null,null,null,null,null,null,null,null,null,null,5931,"Nagyszénás","Békés"]
[null,null,null,null,null,null,null,null,null,null,null,null,null,null,null,null,null,null,null,null,9072,"Nagyszentjános","Győr-Moson-Sopron"]
[null,null,null,null,null,null,null,null,null,null,null,null,null,null,null,null,null,null,null,null,7097,"Nagyszokoly","Tolna"]
[null,null,null,null,null,null,null,null,null,null,null,null,null,null,null,null,null,null,null,null,3398,"Nagytálya","Heves"]
[null,null,null,null,null,null,null,null,null,null,null,null,null,null,null,null,null,null,null,null,2142,"Nagytarcsa","Pest"]
[null,null,null,null,null,null,null,null,null,null,null,null,null,null,null,null,null,null,null,null,8562,"Nagytevel","Veszprém"]
[null,null,null,null,null,null,null,null,null,null,null,null,null,null,null,null,null,null,null,null,9832,"Nagytilaj","Vas"]
[null,null,null,null,null,null,null,null,null,null,null,null,null,null,null,null,null,null,null,null,6612,"Nagytőke","Baranya"]
[null,null,null,null,null,null,null,null,null,null,null,null,null,null,null,null,null,null,null,null,7800,"Nagytótfalu","Csongrád"]
[null,null,null,null,null,null,null,null,null,null,null,null,null,null,null,null,null,null,null,null,3357,"Nagyút","Heves"]
[null,null,null,null,null,null,null,null,null,null,null,null,null,null,null,null,null,null,null,null,4812,"Nagyvarsány","Szabolcs-Szatmár-Bereg"]
[null,null,null,null,null,null,null,null,null,null,null,null,null,null,null,null,null,null,null,null,7912,"Nagyváty","Baranya"]
[null,null,null,null,null,null,null,null,null,null,null,null,null,null,null,null,null,null,null,null,8291,"Nagyvázsony","Veszprém"]
[null,null,null,null,null,null,null,null,null,null,null,null,null,null,null,null,null,null,null,null,7186,"Nagyvejke","Tolna"]
[null,null,null,null,null,null,null,null,null,null,null,null,null,null,null,null,null,null,null,null,8065,"Nagyveleg","Fejér"]
[null,null,null,null,null,null,null,null,null,null,null,null,null,null,null,null,null,null,null,null,2421,"Nagyvenyim","Fejér"]
[null,null,null,null,null,null,null,null,null,null,null,null,null,null,null,null,null,null,null,null,3349,"Nagyvisnyó","Heves"]
[null,null,null,null,null,null,null,null,null,null,null,null,null,null,null,null,null,null,null,null,7215,"Nak","Tolna"]
[null,null,null,null,null,null,null,null,null,null,null,null,null,null,null,null,null,null,null,null,4552,"Napkor","Szabolcs-Szatmár-Bereg"]
[null,null,null,null,null,null,null,null,null,null,null,null,null,null,null,null,null,null,null,null,9797,"Nárai","Vas"]
[null,null,null,null,null,null,null,null,null,null,null,null,null,null,null,null,null,null,null,null,9793,"Narda","Vas"]
[null,null,null,null,null,null,null,null,null,null,null,null,null,null,null,null,null,null,null,null,2899,"Naszály","Komárom-Esztergom"]
[null,null,null,null,null,null,null,null,null,null,null,null,null,null,null,null,null,null,null,null,3463,"Négyes","Borsod-Abaúj-Zemplén"]
[null,null,null,null,null,null,null,null,null,null,null,null,null,null,null,null,null,null,null,null,3646,"Nekézseny","Borsod-Abaúj-Zemplén"]
[null,null,null,null,null,null,null,null,null,null,null,null,null,null,null,null,null,null,null,null,8923,"Nemesapáti","Zala"]
[null,null,null,null,null,null,null,null,null,null,null,null,null,null,null,null,null,null,null,null,3592,"Nemesbikk","Borsod-Abaúj-Zemplén"]
[null,null,null,null,null,null,null,null,null,null,null,null,null,null,null,null,null,null,null,null,9749,"Nemesbőd","Szabolcs-Szatmár-Bereg"]
[null,null,null,null,null,null,null,null,null,null,null,null,null,null,null,null,null,null,null,null,4942,"Nemesborzova","Vas"]
[null,null,null,null,null,null,null,null,null,null,null,null,null,null,null,null,null,null,null,null,8371,"Nemesbük","Zala"]
[null,null,null,null,null,null,null,null,null,null,null,null,null,null,null,null,null,null,null,null,9739,"Nemescsó","Vas"]
[null,null,null,null,null,null,null,null,null,null,null,null,null,null,null,null,null,null,null,null,8722,"Nemesdéd","Somogy"]
[null,null,null,null,null,null,null,null,null,null,null,null,null,null,null,null,null,null,null,null,8522,"Nemesgörzsöny","Veszprém"]
[null,null,null,null,null,null,null,null,null,null,null,null,null,null,null,null,null,null,null,null,8284,"Nemesgulács","Veszprém"]
[null,null,null,null,null,null,null,null,null,null,null,null,null,null,null,null,null,null,null,null,8471,"Nemeshany","Veszprém"]
[null,null,null,null,null,null,null,null,null,null,null,null,null,null,null,null,null,null,null,null,8925,"Nemeshetés","Zala"]
[null,null,null,null,null,null,null,null,null,null,null,null,null,null,null,null,null,null,null,null,7981,"Nemeske","Baranya"]
[null,null,null,null,null,null,null,null,null,null,null,null,null,null,null,null,null,null,null,null,9471,"Nemeskér","Győr-Moson-Sopron"]
[null,null,null,null,null,null,null,null,null,null,null,null,null,null,null,null,null,null,null,null,9548,"Nemeskeresztúr","Vas"]
[null,null,null,null,null,null,null,null,null,null,null,null,null,null,null,null,null,null,null,null,8717,"Nemeskisfalud","Somogy"]
[null,null,null,null,null,null,null,null,null,null,null,null,null,null,null,null,null,null,null,null,9542,"Nemeskocs","Vas"]
[null,null,null,null,null,null,null,null,null,null,null,null,null,null,null,null,null,null,null,null,9775,"Nemeskolta","Vas"]
[null,null,null,null,null,null,null,null,null,null,null,null,null,null,null,null,null,null,null,null,9663,"Nemesládony","Vas"]
[null,null,null,null,null,null,null,null,null,null,null,null,null,null,null,null,null,null,null,null,9953,"Nemesmedves","Vas"]
[null,null,null,null,null,null,null,null,null,null,null,null,null,null,null,null,null,null,null,null,6345,"Nemesnádudvar","Bács-Kiskun"]
[null,null,null,null,null,null,null,null,null,null,null,null,null,null,null,null,null,null,null,null,8976,"Nemesnép","Zala"]
[null,null,null,null,null,null,null,null,null,null,null,null,null,null,null,null,null,null,null,null,8856,"Nemespátró","Zala"]
[null,null,null,null,null,null,null,null,null,null,null,null,null,null,null,null,null,null,null,null,8915,"Nemesrádó","Zala"]
[null,null,null,null,null,null,null,null,null,null,null,null,null,null,null,null,null,null,null,null,9782,"Nemesrempehollós","Vas"]
[null,null,null,null,null,null,null,null,null,null,null,null,null,null,null,null,null,null,null,null,8925,"Nemessándorháza","Zala"]
[null,null,null,null,null,null,null,null,null,null,null,null,null,null,null,null,null,null,null,null,9533,"Nemesszalók","Veszprém"]
[null,null,null,null,null,null,null,null,null,null,null,null,null,null,null,null,null,null,null,null,8925,"Nemesszentandrás","Zala"]
[null,null,null,null,null,null,null,null,null,null,null,null,null,null,null,null,null,null,null,null,8248,"Nemesvámos","Veszprém"]
[null,null,null,null,null,null,null,null,null,null,null,null,null,null,null,null,null,null,null,null,8738,"Nemesvid","Somogy"]
[null,null,null,null,null,null,null,null,null,null,null,null,null,null,null,null,null,null,null,null,8311,"Nemesvita","Veszprém"]
[null,null,null,null,null,null,null,null,null,null,null,null,null,null,null,null,null,null,null,null,8581,"Németbánya","Veszprém"]
[null,null,null,null,null,null,null,null,null,null,null,null,null,null,null,null,null,null,null,null,8918,"Németfalu","Zala"]
[null,null,null,null,null,null,null,null,null,null,null,null,null,null,null,null,null,null,null,null,7039,"Németkér","Tolna"]
[null,null,null,null,null,null,null,null,null,null,null,null,null,null,null,null,null,null,null,null,3152,"Nemti","Nógrád"]
[null,null,null,null,null,null,null,null,null,null,null,null,null,null,null,null,null,null,null,null,2544,"Neszmély","Komárom-Esztergom"]
[null,null,null,null,null,null,null,null,null,null,null,null,null,null,null,null,null,null,null,null,2618,"Nézsa","Nógrád"]
[null,null,null,null,null,null,null,null,null,null,null,null,null,null,null,null,null,null,null,null,9652,"Nick","Vas"]
[null,null,null,null,null,null,null,null,null,null,null,null,null,null,null,null,null,null,null,null,8706,"Nikla","Somogy"]
[null,null,null,null,null,null,null,null,null,null,null,null,null,null,null,null,null,null,null,null,2642,"Nógrád","Nógrád"]
[null,null,null,null,null,null,null,null,null,null,null,null,null,null,null,null,null,null,null,null,2691,"Nógrádkövesd","Nógrád"]
[null,null,null,null,null,null,null,null,null,null,null,null,null,null,null,null,null,null,null,null,2675,"Nógrádmarcal","Nógrád"]
[null,null,null,null,null,null,null,null,null,null,null,null,null,null,null,null,null,null,null,null,3132,"Nógrádmegyer","Nógrád"]
[null,null,null,null,null,null,null,null,null,null,null,null,null,null,null,null,null,null,null,null,2685,"Nógrádsáp","Nógrád"]
[null,null,null,null,null,null,null,null,null,null,null,null,null,null,null,null,null,null,null,null,3179,"Nógrádsipek","Nógrád"]
[null,null,null,null,null,null,null,null,null,null,null,null,null,null,null,null,null,null,null,null,3187,"Nógrádszakál","Nógrád"]
[null,null,null,null,null,null,null,null,null,null,null,null,null,null,null,null,null,null,null,null,8591,"Nóráp","Veszprém"]
[null,null,null,null,null,null,null,null,null,null,null,null,null,null,null,null,null,null,null,null,8456,"Noszlop","Veszprém"]
[null,null,null,null,null,null,null,null,null,null,null,null,null,null,null,null,null,null,null,null,3325,"Noszvaj","Heves"]
[null,null,null,null,null,null,null,null,null,null,null,null,null,null,null,null,null,null,null,null,2610,"Nőtincs","Zala"]
[null,null,null,null,null,null,null,null,null,null,null,null,null,null,null,null,null,null,null,null,8948,"Nova","Heves"]
[null,null,null,null,null,null,null,null,null,null,null,null,null,null,null,null,null,null,null,null,3327,"Novaj","Borsod-Abaúj-Zemplén"]
[null,null,null,null,null,null,null,null,null,null,null,null,null,null,null,null,null,null,null,null,3872,"Novajidrány","Nógrád"]
[null,null,null,null,null,null,null,null,null,null,null,null,null,null,null,null,null,null,null,null,9096,"Nyalka","Győr-Moson-Sopron"]
[null,null,null,null,null,null,null,null,null,null,null,null,null,null,null,null,null,null,null,null,8512,"Nyárád","Veszprém"]
[null,null,null,null,null,null,null,null,null,null,null,null,null,null,null,null,null,null,null,null,2723,"Nyáregyháza","Pest"]
[null,null,null,null,null,null,null,null,null,null,null,null,null,null,null,null,null,null,null,null,6032,"Nyárlőrinc","Bács-Kiskun"]
[null,null,null,null,null,null,null,null,null,null,null,null,null,null,null,null,null,null,null,null,2712,"Nyársapát","Pest"]
[null,null,null,null,null,null,null,null,null,null,null,null,null,null,null,null,null,null,null,null,3433,"Nyékládháza","Borsod-Abaúj-Zemplén"]
[null,null,null,null,null,null,null,null,null,null,null,null,null,null,null,null,null,null,null,null,2537,"Nyergesújfalu","Komárom-Esztergom"]
[null,null,null,null,null,null,null,null,null,null,null,null,null,null,null,null,null,null,null,null,2536,"Nyergesújfalu","Komárom-Esztergom"]
[null,null,null,null,null,null,null,null,null,null,null,null,null,null,null,null,null,null,null,null,3809,"Nyésta","Borsod-Abaúj-Zemplén"]
[null,null,null,null,null,null,null,null,null,null,null,null,null,null,null,null,null,null,null,null,8612,"Nyim","Somogy"]
[null,null,null,null,null,null,null,null,null,null,null,null,null,null,null,null,null,null,null,null,4264,"Nyírábrány","Hajdú-Bihar"]
[null,null,null,null,null,null,null,null,null,null,null,null,null,null,null,null,null,null,null,null,4262,"Nyíracsád","Hajdú-Bihar"]
[null,null,null,null,null,null,null,null,null,null,null,null,null,null,null,null,null,null,null,null,8454,"Nyirád","Veszprém"]
[null,null,null,null,null,null,null,null,null,null,null,null,null,null,null,null,null,null,null,null,4253,"Nyíradony","Hajdú-Bihar"]
[null,null,null,null,null,null,null,null,null,null,null,null,null,null,null,null,null,null,null,null,4252,"Nyíradony","Hajdú-Bihar"]
[null,null,null,null,null,null,null,null,null,null,null,null,null,null,null,null,null,null,null,null,4254,"Nyíradony","Hajdú-Bihar"]
[null,null,null,null,null,null,null,null,null,null,null,null,null,null,null,null,null,null,null,null,4300,"Nyírbátor","Szabolcs-Szatmár-Bereg"]
[null,null,null,null,null,null,null,null,null,null,null,null,null,null,null,null,null,null,null,null,4372,"Nyírbéltek","Szabolcs-Szatmár-Bereg"]
[null,null,null,null,null,null,null,null,null,null,null,null,null,null,null,null,null,null,null,null,4361,"Nyírbogát","Szabolcs-Szatmár-Bereg"]
[null,null,null,null,null,null,null,null,null,null,null,null,null,null,null,null,null,null,null,null,4511,"Nyírbogdány","Szabolcs-Szatmár-Bereg"]
[null,null,null,null,null,null,null,null,null,null,null,null,null,null,null,null,null,null,null,null,4356,"Nyírcsaholy","Szabolcs-Szatmár-Bereg"]
[null,null,null,null,null,null,null,null,null,null,null,null,null,null,null,null,null,null,null,null,4331,"Nyírcsászári","Szabolcs-Szatmár-Bereg"]
[null,null,null,null,null,null,null,null,null,null,null,null,null,null,null,null,null,null,null,null,4332,"Nyírderzs","Szabolcs-Szatmár-Bereg"]
[null,null,null,null,null,null,null,null,null,null,null,null,null,null,null,null,null,null,null,null,4405,"Nyíregyháza","Szabolcs-Szatmár-Bereg"]
[null,null,null,null,null,null,null,null,null,null,null,null,null,null,null,null,null,null,null,null,4246,"Nyíregyháza","Szabolcs-Szatmár-Bereg"]
[null,null,null,null,null,null,null,null,null,null,null,null,null,null,null,null,null,null,null,null,4433,"Nyíregyháza","Szabolcs-Szatmár-Bereg"]
[null,null,null,null,null,null,null,null,null,null,null,null,null,null,null,null,null,null,null,null,4412,"Nyíregyháza","Szabolcs-Szatmár-Bereg"]
[null,null,null,null,null,null,null,null,null,null,null,null,null,null,null,null,null,null,null,null,4432,"Nyíregyháza","Szabolcs-Szatmár-Bereg"]
[null,null,null,null,null,null,null,null,null,null,null,null,null,null,null,null,null,null,null,null,4551,"Nyíregyháza","Szabolcs-Szatmár-Bereg"]
[null,null,null,null,null,null,null,null,null,null,null,null,null,null,null,null,null,null,null,null,4431,"Nyíregyháza","Szabolcs-Szatmár-Bereg"]
[null,null,null,null,null,null,null,null,null,null,null,null,null,null,null,null,null,null,null,null,4481,"Nyíregyháza","Szabolcs-Szatmár-Bereg"]
[null,null,null,null,null,null,null,null,null,null,null,null,null,null,null,null,null,null,null,null,4400,"Nyíregyháza","Szabolcs-Szatmár-Bereg"]
[null,null,null,null,null,null,null,null,null,null,null,null,null,null,null,null,null,null,null,null,4362,"Nyírgelse","Szabolcs-Szatmár-Bereg"]
[null,null,null,null,null,null,null,null,null,null,null,null,null,null,null,null,null,null,null,null,4311,"Nyírgyulaj","Szabolcs-Szatmár-Bereg"]
[null,null,null,null,null,null,null,null,null,null,null,null,null,null,null,null,null,null,null,null,3997,"Nyíri","Borsod-Abaúj-Zemplén"]
[null,null,null,null,null,null,null,null,null,null,null,null,null,null,null,null,null,null,null,null,4535,"Nyíribrony","Szabolcs-Szatmár-Bereg"]
[null,null,null,null,null,null,null,null,null,null,null,null,null,null,null,null,null,null,null,null,4541,"Nyírjákó","Szabolcs-Szatmár-Bereg"]
[null,null,null,null,null,null,null,null,null,null,null,null,null,null,null,null,null,null,null,null,4544,"Nyírkarász","Szabolcs-Szatmár-Bereg"]
[null,null,null,null,null,null,null,null,null,null,null,null,null,null,null,null,null,null,null,null,4333,"Nyírkáta","Szabolcs-Szatmár-Bereg"]
[null,null,null,null,null,null,null,null,null,null,null,null,null,null,null,null,null,null,null,null,4537,"Nyírkércs","Szabolcs-Szatmár-Bereg"]
[null,null,null,null,null,null,null,null,null,null,null,null,null,null,null,null,null,null,null,null,4632,"Nyírlövő","Szabolcs-Szatmár-Bereg"]
[null,null,null,null,null,null,null,null,null,null,null,null,null,null,null,null,null,null,null,null,4371,"Nyírlugos","Szabolcs-Szatmár-Bereg"]
[null,null,null,null,null,null,null,null,null,null,null,null,null,null,null,null,null,null,null,null,4564,"Nyírmada","Szabolcs-Szatmár-Bereg"]
[null,null,null,null,null,null,null,null,null,null,null,null,null,null,null,null,null,null,null,null,4263,"Nyírmártonfalva","Hajdú-Bihar"]
[null,null,null,null,null,null,null,null,null,null,null,null,null,null,null,null,null,null,null,null,4722,"Nyírmeggyes","Szabolcs-Szatmár-Bereg"]
[null,null,null,null,null,null,null,null,null,null,null,null,null,null,null,null,null,null,null,null,4363,"Nyírmihálydi","Szabolcs-Szatmár-Bereg"]
[null,null,null,null,null,null,null,null,null,null,null,null,null,null,null,null,null,null,null,null,4822,"Nyírparasznya","Szabolcs-Szatmár-Bereg"]
[null,null,null,null,null,null,null,null,null,null,null,null,null,null,null,null,null,null,null,null,4531,"Nyírpazony","Szabolcs-Szatmár-Bereg"]
[null,null,null,null,null,null,null,null,null,null,null,null,null,null,null,null,null,null,null,null,4376,"Nyírpilis","Szabolcs-Szatmár-Bereg"]
[null,null,null,null,null,null,null,null,null,null,null,null,null,null,null,null,null,null,null,null,4522,"Nyírtass","Szabolcs-Szatmár-Bereg"]
[null,null,null,null,null,null,null,null,null,null,null,null,null,null,null,null,null,null,null,null,4461,"Nyírtelek","Szabolcs-Szatmár-Bereg"]
[null,null,null,null,null,null,null,null,null,null,null,null,null,null,null,null,null,null,null,null,4554,"Nyírtét","Szabolcs-Szatmár-Bereg"]
[null,null,null,null,null,null,null,null,null,null,null,null,null,null,null,null,null,null,null,null,4532,"Nyírtura","Szabolcs-Szatmár-Bereg"]
[null,null,null,null,null,null,null,null,null,null,null,null,null,null,null,null,null,null,null,null,4341,"Nyírvasvári","Szabolcs-Szatmár-Bereg"]
[null,null,null,null,null,null,null,null,null,null,null,null,null,null,null,null,null,null,null,null,9682,"Nyőgér","Borsod-Abaúj-Zemplén"]
[null,null,null,null,null,null,null,null,null,null,null,null,null,null,null,null,null,null,null,null,3795,"Nyomár","Vas"]
[null,null,null,null,null,null,null,null,null,null,null,null,null,null,null,null,null,null,null,null,7912,"Nyugotszenterzsébet","Baranya"]
[null,null,null,null,null,null,null,null,null,null,null,null,null,null,null,null,null,null,null,null,9082,"Nyúl","Győr-Moson-Sopron"]
[null,null,null,null,null,null,null,null,null,null,null,null,null,null,null,null,null,null,null,null,7695,"Óbánya","Baranya"]
[null,null,null,null,null,null,null,null,null,null,null,null,null,null,null,null,null,null,null,null,2063,"Óbarok","Fejér"]
[null,null,null,null,null,null,null,null,null,null,null,null,null,null,null,null,null,null,null,null,8272,"Óbudavár","Veszprém"]
[null,null,null,null,null,null,null,null,null,null,null,null,null,null,null,null,null,null,null,null,8292,"Öcs","Pest"]
[null,null,null,null,null,null,null,null,null,null,null,null,null,null,null,null,null,null,null,null,2364,"Ócsa","Baranya"]
[null,null,null,null,null,null,null,null,null,null,null,null,null,null,null,null,null,null,null,null,7814,"Ócsárd","Baranya"]
[null,null,null,null,null,null,null,null,null,null,null,null,null,null,null,null,null,null,null,null,7143,"Őcsény","Szabolcs-Szatmár-Bereg"]
[null,null,null,null,null,null,null,null,null,null,null,null,null,null,null,null,null,null,null,null,5451,"Öcsöd","Csongrád"]
[null,null,null,null,null,null,null,null,null,null,null,null,null,null,null,null,null,null,null,null,7695,"Ófalu","Zala"]
[null,null,null,null,null,null,null,null,null,null,null,null,null,null,null,null,null,null,null,null,4558,"Ófehértó","Békés"]
[null,null,null,null,null,null,null,null,null,null,null,null,null,null,null,null,null,null,null,null,6923,"Óföldeák","Baranya"]
[null,null,null,null,null,null,null,null,null,null,null,null,null,null,null,null,null,null,null,null,8342,"Óhid","Baranya"]
[null,null,null,null,null,null,null,null,null,null,null,null,null,null,null,null,null,null,null,null,5534,"Okány","Baranya"]
[null,null,null,null,null,null,null,null,null,null,null,null,null,null,null,null,null,null,null,null,7957,"Okorág","Vas"]
[null,null,null,null,null,null,null,null,null,null,null,null,null,null,null,null,null,null,null,null,4755,"Ököritófülpös","Veszprém"]
[null,null,null,null,null,null,null,null,null,null,null,null,null,null,null,null,null,null,null,null,7681,"Okorvölgy","Borsod-Abaúj-Zemplén"]
[null,null,null,null,null,null,null,null,null,null,null,null,null,null,null,null,null,null,null,null,7745,"Olasz","Szabolcs-Szatmár-Bereg"]
[null,null,null,null,null,null,null,null,null,null,null,null,null,null,null,null,null,null,null,null,9824,"Olaszfa","Szabolcs-Szatmár-Bereg"]
[null,null,null,null,null,null,null,null,null,null,null,null,null,null,null,null,null,null,null,null,8414,"Olaszfalu","Baranya"]
[null,null,null,null,null,null,null,null,null,null,null,null,null,null,null,null,null,null,null,null,3933,"Olaszliszka","Vas"]
[null,null,null,null,null,null,null,null,null,null,null,null,null,null,null,null,null,null,null,null,9621,"Ölbő","Zala"]
[null,null,null,null,null,null,null,null,null,null,null,null,null,null,null,null,null,null,null,null,4826,"Olcsva","Borsod-Abaúj-Zemplén"]
[null,null,null,null,null,null,null,null,null,null,null,null,null,null,null,null,null,null,null,null,4914,"Olcsvaapáti","Borsod-Abaúj-Zemplén"]
[null,null,null,null,null,null,null,null,null,null,null,null,null,null,null,null,null,null,null,null,7824,"Old","Szabolcs-Szatmár-Bereg"]
[null,null,null,null,null,null,null,null,null,null,null,null,null,null,null,null,null,null,null,null,9733,"Ólmod","Csongrád"]
[null,null,null,null,null,null,null,null,null,null,null,null,null,null,null,null,null,null,null,null,8886,"Oltárc","Zala"]
[null,null,null,null,null,null,null,null,null,null,null,null,null,null,null,null,null,null,null,null,4373,"Ömböly","Somogy"]
[null,null,null,null,null,null,null,null,null,null,null,null,null,null,null,null,null,null,null,null,3562,"Onga","Somogy"]
[null,null,null,null,null,null,null,null,null,null,null,null,null,null,null,null,null,null,null,null,3551,"Ónod","Bács-Kiskun"]
[null,null,null,null,null,null,null,null,null,null,null,null,null,null,null,null,null,null,null,null,4821,"Ópályi","Vas"]
[null,null,null,null,null,null,null,null,null,null,null,null,null,null,null,null,null,null,null,null,6767,"Ópusztaszer","Baranya"]
[null,null,null,null,null,null,null,null,null,null,null,null,null,null,null,null,null,null,null,null,4336,"Őr","Bács-Kiskun"]
[null,null,null,null,null,null,null,null,null,null,null,null,null,null,null,null,null,null,null,null,8935,"Orbányosfa","Zala"]
[null,null,null,null,null,null,null,null,null,null,null,null,null,null,null,null,null,null,null,null,2162,"Őrbottyán","Borsod-Abaúj-Zemplén"]
[null,null,null,null,null,null,null,null,null,null,null,null,null,null,null,null,null,null,null,null,7400,"Orci","Békés"]
[null,null,null,null,null,null,null,null,null,null,null,null,null,null,null,null,null,null,null,null,8635,"Ordacsehi","Békés"]
[null,null,null,null,null,null,null,null,null,null,null,null,null,null,null,null,null,null,null,null,6335,"Ordas","Békés"]
[null,null,null,null,null,null,null,null,null,null,null,null,null,null,null,null,null,null,null,null,6311,"Öregcsertő","Békés"]
[null,null,null,null,null,null,null,null,null,null,null,null,null,null,null,null,null,null,null,null,8697,"Öreglak","Veszprém"]
[null,null,null,null,null,null,null,null,null,null,null,null,null,null,null,null,null,null,null,null,9982,"Orfalu","Komárom-Esztergom"]
[null,null,null,null,null,null,null,null,null,null,null,null,null,null,null,null,null,null,null,null,7677,"Orfű","Baranya"]
[null,null,null,null,null,null,null,null,null,null,null,null,null,null,null,null,null,null,null,null,6077,"Orgovány","Zala"]
[null,null,null,null,null,null,null,null,null,null,null,null,null,null,null,null,null,null,null,null,2671,"Őrhalom","Zala"]
[null,null,null,null,null,null,null,null,null,null,null,null,null,null,null,null,null,null,null,null,9933,"Őrimagyarósd","Győr-Moson-Sopron"]
[null,null,null,null,null,null,null,null,null,null,null,null,null,null,null,null,null,null,null,null,9941,"Őriszentpéter","Vas"]
[null,null,null,null,null,null,null,null,null,null,null,null,null,null,null,null,null,null,null,null,2377,"Örkény","Heves"]
[null,null,null,null,null,null,null,null,null,null,null,null,null,null,null,null,null,null,null,null,8983,"Ormándlak","Vas"]
[null,null,null,null,null,null,null,null,null,null,null,null,null,null,null,null,null,null,null,null,5222,"Örményes","Borsod-Abaúj-Zemplén"]
[null,null,null,null,null,null,null,null,null,null,null,null,null,null,null,null,null,null,null,null,5556,"Örménykút","Somogy"]
[null,null,null,null,null,null,null,null,null,null,null,null,null,null,null,null,null,null,null,null,3743,"Ormosbánya","Borsod-Abaúj-Zemplén"]
[null,null,null,null,null,null,null,null,null,null,null,null,null,null,null,null,null,null,null,null,5904,"Orosháza","Borsod-Abaúj-Zemplén"]
[null,null,null,null,null,null,null,null,null,null,null,null,null,null,null,null,null,null,null,null,5903,"Orosháza","Borsod-Abaúj-Zemplén"]
[null,null,null,null,null,null,null,null,null,null,null,null,null,null,null,null,null,null,null,null,5905,"Orosháza","Borsod-Abaúj-Zemplén"]
[null,null,null,null,null,null,null,null,null,null,null,null,null,null,null,null,null,null,null,null,5900,"Orosháza","Borsod-Abaúj-Zemplén"]
[null,null,null,null,null,null,null,null,null,null,null,null,null,null,null,null,null,null,null,null,8458,"Oroszi","Borsod-Abaúj-Zemplén"]
[null,null,null,null,null,null,null,null,null,null,null,null,null,null,null,null,null,null,null,null,2840,"Oroszlány","Borsod-Abaúj-Zemplén"]
[null,null,null,null,null,null,null,null,null,null,null,null,null,null,null,null,null,null,null,null,7370,"Oroszló","Borsod-Abaúj-Zemplén"]
[null,null,null,null,null,null,null,null,null,null,null,null,null,null,null,null,null,null,null,null,8744,"Orosztony","Baranya"]
[null,null,null,null,null,null,null,null,null,null,null,null,null,null,null,null,null,null,null,null,8954,"Ortaháza","Zala"]
[null,null,null,null,null,null,null,null,null,null,null,null,null,null,null,null,null,null,null,null,8854,"Őrtilos","Tolna"]
[null,null,null,null,null,null,null,null,null,null,null,null,null,null,null,null,null,null,null,null,8242,"Örvényes","Veszprém"]
[null,null,null,null,null,null,null,null,null,null,null,null,null,null,null,null,null,null,null,null,2610,"Ősagárd","Tolna"]
[null,null,null,null,null,null,null,null,null,null,null,null,null,null,null,null,null,null,null,null,8161,"Ősi","Jász-Nagykun-Szolnok"]
[null,null,null,null,null,null,null,null,null,null,null,null,null,null,null,null,null,null,null,null,8191,"Öskü","Szabolcs-Szatmár-Bereg"]
[null,null,null,null,null,null,null,null,null,null,null,null,null,null,null,null,null,null,null,null,9354,"Osli","Vas"]
[null,null,null,null,null,null,null,null,null,null,null,null,null,null,null,null,null,null,null,null,9512,"Ostffyasszonyfa","Szabolcs-Szatmár-Bereg"]
[null,null,null,null,null,null,null,null,null,null,null,null,null,null,null,null,null,null,null,null,3326,"Ostoros","Szabolcs-Szatmár-Bereg"]
[null,null,null,null,null,null,null,null,null,null,null,null,null,null,null,null,null,null,null,null,9825,"Oszkó","Pest"]
[null,null,null,null,null,null,null,null,null,null,null,null,null,null,null,null,null,null,null,null,3591,"Oszlár","Bács-Kiskun"]
[null,null,null,null,null,null,null,null,null,null,null,null,null,null,null,null,null,null,null,null,7444,"Osztopán","Somogy"]
[null,null,null,null,null,null,null,null,null,null,null,null,null,null,null,null,null,null,null,null,9153,"Öttevény","Nógrád"]
[null,null,null,null,null,null,null,null,null,null,null,null,null,null,null,null,null,null,null,null,6784,"Öttömös","Vas"]
[null,null,null,null,null,null,null,null,null,null,null,null,null,null,null,null,null,null,null,null,7511,"Ötvöskónyi","Vas"]
[null,null,null,null,null,null,null,null,null,null,null,null,null,null,null,null,null,null,null,null,3604,"Ózd","Pest"]
[null,null,null,null,null,null,null,null,null,null,null,null,null,null,null,null,null,null,null,null,3651,"Ózd","Jász-Nagykun-Szolnok"]
[null,null,null,null,null,null,null,null,null,null,null,null,null,null,null,null,null,null,null,null,3661,"Ózd","Békés"]
[null,null,null,null,null,null,null,null,null,null,null,null,null,null,null,null,null,null,null,null,3603,"Ózd","Somogy"]
[null,null,null,null,null,null,null,null,null,null,null,null,null,null,null,null,null,null,null,null,3662,"Ózd","Veszprém"]
[null,null,null,null,null,null,null,null,null,null,null,null,null,null,null,null,null,null,null,null,3625,"Ózd","Nógrád"]
[null,null,null,null,null,null,null,null,null,null,null,null,null,null,null,null,null,null,null,null,3621,"Ózd","Veszprém"]
[null,null,null,null,null,null,null,null,null,null,null,null,null,null,null,null,null,null,null,null,3600,"Ózd","Veszprém"]
[null,null,null,null,null,null,null,null,null,null,null,null,null,null,null,null,null,null,null,null,7836,"Ózdfalu","Győr-Moson-Sopron"]
[null,null,null,null,null,null,null,null,null,null,null,null,null,null,null,null,null,null,null,null,8998,"Ozmánbük","Csongrád"]
[null,null,null,null,null,null,null,null,null,null,null,null,null,null,null,null,null,null,null,null,7086,"Ozora","Somogy"]
[null,null,null,null,null,null,null,null,null,null,null,null,null,null,null,null,null,null,null,null,3964,"Pácin","Borsod-Abaúj-Zemplén"]
[null,null,null,null,null,null,null,null,null,null,null,null,null,null,null,null,null,null,null,null,8761,"Pacsa","Zala"]
[null,null,null,null,null,null,null,null,null,null,null,null,null,null,null,null,null,null,null,null,9823,"Pácsony","Vas"]
[null,null,null,null,null,null,null,null,null,null,null,null,null,null,null,null,null,null,null,null,8935,"Padár","Zala"]
[null,null,null,null,null,null,null,null,null,null,null,null,null,null,null,null,null,null,null,null,6075,"Páhi","Bács-Kiskun"]
[null,null,null,null,null,null,null,null,null,null,null,null,null,null,null,null,null,null,null,null,8956,"Páka","Zala"]
[null,null,null,null,null,null,null,null,null,null,null,null,null,null,null,null,null,null,null,null,8799,"Pakod","Zala"]
[null,null,null,null,null,null,null,null,null,null,null,null,null,null,null,null,null,null,null,null,8095,"Pákozd","Fejér"]
[null,null,null,null,null,null,null,null,null,null,null,null,null,null,null,null,null,null,null,null,7027,"Paks","Tolna"]
[null,null,null,null,null,null,null,null,null,null,null,null,null,null,null,null,null,null,null,null,7030,"Paks","Tolna"]
[null,null,null,null,null,null,null,null,null,null,null,null,null,null,null,null,null,null,null,null,7370,"Palé","Baranya"]
[null,null,null,null,null,null,null,null,null,null,null,null,null,null,null,null,null,null,null,null,7042,"Pálfa","Tolna"]
[null,null,null,null,null,null,null,null,null,null,null,null,null,null,null,null,null,null,null,null,8990,"Pálfiszeg","Zala"]
[null,null,null,null,null,null,null,null,null,null,null,null,null,null,null,null,null,null,null,null,3994,"Pálháza","Borsod-Abaúj-Zemplén"]
[null,null,null,null,null,null,null,null,null,null,null,null,null,null,null,null,null,null,null,null,9345,"Páli","Győr-Moson-Sopron"]
[null,null,null,null,null,null,null,null,null,null,null,null,null,null,null,null,null,null,null,null,7771,"Palkonya","Baranya"]
[null,null,null,null,null,null,null,null,null,null,null,null,null,null,null,null,null,null,null,null,7561,"Pálmajor","Somogy"]
[null,null,null,null,null,null,null,null,null,null,null,null,null,null,null,null,null,null,null,null,6112,"Pálmonostora","Bács-Kiskun"]
[null,null,null,null,null,null,null,null,null,null,null,null,null,null,null,null,null,null,null,null,7727,"Palotabozsok","Baranya"]
[null,null,null,null,null,null,null,null,null,null,null,null,null,null,null,null,null,null,null,null,3042,"Palotás","Nógrád"]
[null,null,null,null,null,null,null,null,null,null,null,null,null,null,null,null,null,null,null,null,8229,"Paloznak","Veszprém"]
[null,null,null,null,null,null,null,null,null,null,null,null,null,null,null,null,null,null,null,null,3821,"Pamlény","Borsod-Abaúj-Zemplén"]
[null,null,null,null,null,null,null,null,null,null,null,null,null,null,null,null,null,null,null,null,8698,"Pamuk","Somogy"]
[null,null,null,null,null,null,null,null,null,null,null,null,null,null,null,null,null,null,null,null,2214,"Pánd","Pest"]
[null,null,null,null,null,null,null,null,null,null,null,null,null,null,null,null,null,null,null,null,9937,"Pankasz","Vas"]
[null,null,null,null,null,null,null,null,null,null,null,null,null,null,null,null,null,null,null,null,9090,"Pannonhalma","Győr-Moson-Sopron"]
[null,null,null,null,null,null,null,null,null,null,null,null,null,null,null,null,null,null,null,null,3898,"Pányok","Borsod-Abaúj-Zemplén"]
[null,null,null,null,null,null,null,null,null,null,null,null,null,null,null,null,null,null,null,null,4913,"Panyola","Szabolcs-Szatmár-Bereg"]
[null,null,null,null,null,null,null,null,null,null,null,null,null,null,null,null,null,null,null,null,4631,"Pap","Szabolcs-Szatmár-Bereg"]
[null,null,null,null,null,null,null,null,null,null,null,null,null,null,null,null,null,null,null,null,8511,"Pápa","Veszprém"]
[null,null,null,null,null,null,null,null,null,null,null,null,null,null,null,null,null,null,null,null,8591,"Pápa","Veszprém"]
[null,null,null,null,null,null,null,null,null,null,null,null,null,null,null,null,null,null,null,null,8598,"Pápa","Veszprém"]
[null,null,null,null,null,null,null,null,null,null,null,null,null,null,null,null,null,null,null,null,8500,"Pápa","Veszprém"]
[null,null,null,null,null,null,null,null,null,null,null,null,null,null,null,null,null,null,null,null,8593,"Pápadereske","Veszprém"]
[null,null,null,null,null,null,null,null,null,null,null,null,null,null,null,null,null,null,null,null,8596,"Pápakovácsi","Veszprém"]
[null,null,null,null,null,null,null,null,null,null,null,null,null,null,null,null,null,null,null,null,8594,"Pápasalamon","Veszprém"]
[null,null,null,null,null,null,null,null,null,null,null,null,null,null,null,null,null,null,null,null,8556,"Pápateszér","Veszprém"]
[null,null,null,null,null,null,null,null,null,null,null,null,null,null,null,null,null,null,null,null,8183,"Papkeszi","Veszprém"]
[null,null,null,null,null,null,null,null,null,null,null,null,null,null,null,null,null,null,null,null,9515,"Pápoc","Vas"]
[null,null,null,null,null,null,null,null,null,null,null,null,null,null,null,null,null,null,null,null,4338,"Papos","Szabolcs-Szatmár-Bereg"]
[null,null,null,null,null,null,null,null,null,null,null,null,null,null,null,null,null,null,null,null,7838,"Páprád","Baranya"]
[null,null,null,null,null,null,null,null,null,null,null,null,null,null,null,null,null,null,null,null,3244,"Parád","Heves"]
[null,null,null,null,null,null,null,null,null,null,null,null,null,null,null,null,null,null,null,null,3240,"Parád","Heves"]
[null,null,null,null,null,null,null,null,null,null,null,null,null,null,null,null,null,null,null,null,3242,"Parádsasvár","Heves"]
[null,null,null,null,null,null,null,null,null,null,null,null,null,null,null,null,null,null,null,null,3777,"Parasznya","Borsod-Abaúj-Zemplén"]
[null,null,null,null,null,null,null,null,null,null,null,null,null,null,null,null,null,null,null,null,4475,"Paszab","Szabolcs-Szatmár-Bereg"]
[null,null,null,null,null,null,null,null,null,null,null,null,null,null,null,null,null,null,null,null,3065,"Pásztó","Nógrád"]
[null,null,null,null,null,null,null,null,null,null,null,null,null,null,null,null,null,null,null,null,3082,"Pásztó","Nógrád"]
[null,null,null,null,null,null,null,null,null,null,null,null,null,null,null,null,null,null,null,null,3060,"Pásztó","Nógrád"]
[null,null,null,null,null,null,null,null,null,null,null,null,null,null,null,null,null,null,null,null,9311,"Pásztori","Győr-Moson-Sopron"]
[null,null,null,null,null,null,null,null,null,null,null,null,null,null,null,null,null,null,null,null,8825,"Pat","Zala"]
[null,null,null,null,null,null,null,null,null,null,null,null,null,null,null,null,null,null,null,null,2648,"Patak","Nógrád"]
[null,null,null,null,null,null,null,null,null,null,null,null,null,null,null,null,null,null,null,null,7463,"Patalom","Somogy"]
[null,null,null,null,null,null,null,null,null,null,null,null,null,null,null,null,null,null,null,null,7923,"Patapoklosi","Baranya"]
[null,null,null,null,null,null,null,null,null,null,null,null,null,null,null,null,null,null,null,null,7477,"Patca","Somogy"]
[null,null,null,null,null,null,null,null,null,null,null,null,null,null,null,null,null,null,null,null,8092,"Pátka","Fejér"]
[null,null,null,null,null,null,null,null,null,null,null,null,null,null,null,null,null,null,null,null,7536,"Patosfa","Somogy"]
[null,null,null,null,null,null,null,null,null,null,null,null,null,null,null,null,null,null,null,null,4523,"Pátroha","Szabolcs-Szatmár-Bereg"]
[null,null,null,null,null,null,null,null,null,null,null,null,null,null,null,null,null,null,null,null,2668,"Patvarc","Nógrád"]
[null,null,null,null,null,null,null,null,null,null,null,null,null,null,null,null,null,null,null,null,2071,"Páty","Pest"]
[null,null,null,null,null,null,null,null,null,null,null,null,null,null,null,null,null,null,null,null,4766,"Pátyod","Szabolcs-Szatmár-Bereg"]
[null,null,null,null,null,null,null,null,null,null,null,null,null,null,null,null,null,null,null,null,2476,"Pázmánd","Fejér"]
[null,null,null,null,null,null,null,null,null,null,null,null,null,null,null,null,null,null,null,null,9085,"Pázmándfalu","Győr-Moson-Sopron"]
[null,null,null,null,null,null,null,null,null,null,null,null,null,null,null,null,null,null,null,null,2119,"Pécel","Pest"]
[null,null,null,null,null,null,null,null,null,null,null,null,null,null,null,null,null,null,null,null,9754,"Pecöl","Vas"]
[null,null,null,null,null,null,null,null,null,null,null,null,null,null,null,null,null,null,null,null,7693,"Pécs","Baranya"]
[null,null,null,null,null,null,null,null,null,null,null,null,null,null,null,null,null,null,null,null,7691,"Pécs","Baranya"]
[null,null,null,null,null,null,null,null,null,null,null,null,null,null,null,null,null,null,null,null,7600,"Pécs","Baranya"]
[null,null,null,null,null,null,null,null,null,null,null,null,null,null,null,null,null,null,null,null,7621,"Pécs","Baranya"]
[null,null,null,null,null,null,null,null,null,null,null,null,null,null,null,null,null,null,null,null,7622,"Pécs","Baranya"]
[null,null,null,null,null,null,null,null,null,null,null,null,null,null,null,null,null,null,null,null,7623,"Pécs","Baranya"]
[null,null,null,null,null,null,null,null,null,null,null,null,null,null,null,null,null,null,null,null,7624,"Pécs","Baranya"]
[null,null,null,null,null,null,null,null,null,null,null,null,null,null,null,null,null,null,null,null,7625,"Pécs","Baranya"]
[null,null,null,null,null,null,null,null,null,null,null,null,null,null,null,null,null,null,null,null,7626,"Pécs","Baranya"]
[null,null,null,null,null,null,null,null,null,null,null,null,null,null,null,null,null,null,null,null,7627,"Pécs","Baranya"]
[null,null,null,null,null,null,null,null,null,null,null,null,null,null,null,null,null,null,null,null,7628,"Pécs","Baranya"]
[null,null,null,null,null,null,null,null,null,null,null,null,null,null,null,null,null,null,null,null,7629,"Pécs","Baranya"]
[null,null,null,null,null,null,null,null,null,null,null,null,null,null,null,null,null,null,null,null,7630,"Pécs","Baranya"]
[null,null,null,null,null,null,null,null,null,null,null,null,null,null,null,null,null,null,null,null,7631,"Pécs","Baranya"]
[null,null,null,null,null,null,null,null,null,null,null,null,null,null,null,null,null,null,null,null,7632,"Pécs","Baranya"]
[null,null,null,null,null,null,null,null,null,null,null,null,null,null,null,null,null,null,null,null,7633,"Pécs","Baranya"]
[null,null,null,null,null,null,null,null,null,null,null,null,null,null,null,null,null,null,null,null,7634,"Pécs","Baranya"]
[null,null,null,null,null,null,null,null,null,null,null,null,null,null,null,null,null,null,null,null,7635,"Pécs","Baranya"]
[null,null,null,null,null,null,null,null,null,null,null,null,null,null,null,null,null,null,null,null,7636,"Pécs","Baranya"]
[null,null,null,null,null,null,null,null,null,null,null,null,null,null,null,null,null,null,null,null,7951,"Pécsbagota","Baranya"]
[null,null,null,null,null,null,null,null,null,null,null,null,null,null,null,null,null,null,null,null,7766,"Pécsdevecser","Baranya"]
[null,null,null,null,null,null,null,null,null,null,null,null,null,null,null,null,null,null,null,null,8245,"Pécsely","Veszprém"]
[null,null,null,null,null,null,null,null,null,null,null,null,null,null,null,null,null,null,null,null,7762,"Pécsudvard","Baranya"]
[null,null,null,null,null,null,null,null,null,null,null,null,null,null,null,null,null,null,null,null,7720,"Pécsvárad","Baranya"]
[null,null,null,null,null,null,null,null,null,null,null,null,null,null,null,null,null,null,null,null,7831,"Pellérd","Baranya"]
[null,null,null,null,null,null,null,null,null,null,null,null,null,null,null,null,null,null,null,null,3381,"Pély","Heves"]
[null,null,null,null,null,null,null,null,null,null,null,null,null,null,null,null,null,null,null,null,2614,"Penc","Pest"]
[null,null,null,null,null,null,null,null,null,null,null,null,null,null,null,null,null,null,null,null,4267,"Penészlek","Szabolcs-Szatmár-Bereg"]
[null,null,null,null,null,null,null,null,null,null,null,null,null,null,null,null,null,null,null,null,4941,"Penyige","Veszprém"]
[null,null,null,null,null,null,null,null,null,null,null,null,null,null,null,null,null,null,null,null,8426,"Pénzesgyőr","Szabolcs-Szatmár-Bereg"]
[null,null,null,null,null,null,null,null,null,null,null,null,null,null,null,null,null,null,null,null,9099,"Pér","Győr-Moson-Sopron"]
[null,null,null,null,null,null,null,null,null,null,null,null,null,null,null,null,null,null,null,null,2074,"Perbál","Pest"]
[null,null,null,null,null,null,null,null,null,null,null,null,null,null,null,null,null,null,null,null,3853,"Pere","Borsod-Abaúj-Zemplén"]
[null,null,null,null,null,null,null,null,null,null,null,null,null,null,null,null,null,null,null,null,3821,"Perecse","Borsod-Abaúj-Zemplén"]
[null,null,null,null,null,null,null,null,null,null,null,null,null,null,null,null,null,null,null,null,7664,"Pereked","Baranya"]
[null,null,null,null,null,null,null,null,null,null,null,null,null,null,null,null,null,null,null,null,9722,"Perenye","Vas"]
[null,null,null,null,null,null,null,null,null,null,null,null,null,null,null,null,null,null,null,null,9734,"Peresznye","Vas"]
[null,null,null,null,null,null,null,null,null,null,null,null,null,null,null,null,null,null,null,null,9484,"Pereszteg","Győr-Moson-Sopron"]
[null,null,null,null,null,null,null,null,null,null,null,null,null,null,null,null,null,null,null,null,2431,"Perkáta","Fejér"]
[null,null,null,null,null,null,null,null,null,null,null,null,null,null,null,null,null,null,null,null,3756,"Perkupa","Borsod-Abaúj-Zemplén"]
[null,null,null,null,null,null,null,null,null,null,null,null,null,null,null,null,null,null,null,null,2637,"Perőcsény","Pest"]
[null,null,null,null,null,null,null,null,null,null,null,null,null,null,null,null,null,null,null,null,7766,"Peterd","Baranya"]
[null,null,null,null,null,null,null,null,null,null,null,null,null,null,null,null,null,null,null,null,7582,"Péterhida","Somogy"]
[null,null,null,null,null,null,null,null,null,null,null,null,null,null,null,null,null,null,null,null,2209,"Péteri","Pest"]
[null,null,null,null,null,null,null,null,null,null,null,null,null,null,null,null,null,null,null,null,3250,"Pétervására","Heves"]
[null,null,null,null,null,null,null,null,null,null,null,null,null,null,null,null,null,null,null,null,8105,"Pétfürdő","Veszprém"]
[null,null,null,null,null,null,null,null,null,null,null,null,null,null,null,null,null,null,null,null,8921,"Pethőhenye","Zala"]
[null,null,null,null,null,null,null,null,null,null,null,null,null,null,null,null,null,null,null,null,4542,"Petneháza","Szabolcs-Szatmár-Bereg"]
[null,null,null,null,null,null,null,null,null,null,null,null,null,null,null,null,null,null,null,null,3023,"Petőfibánya","Heves"]
[null,null,null,null,null,null,null,null,null,null,null,null,null,null,null,null,null,null,null,null,6113,"Petőfiszállás","Bács-Kiskun"]
[null,null,null,null,null,null,null,null,null,null,null,null,null,null,null,null,null,null,null,null,9443,"Petőháza","Győr-Moson-Sopron"]
[null,null,null,null,null,null,null,null,null,null,null,null,null,null,null,null,null,null,null,null,9826,"Petőmihályfa","Vas"]
[null,null,null,null,null,null,null,null,null,null,null,null,null,null,null,null,null,null,null,null,8984,"Petrikeresztúr","Zala"]
[null,null,null,null,null,null,null,null,null,null,null,null,null,null,null,null,null,null,null,null,8866,"Petrivente","Zala"]
[null,null,null,null,null,null,null,null,null,null,null,null,null,null,null,null,null,null,null,null,7980,"Pettend","Baranya"]
[null,null,null,null,null,null,null,null,null,null,null,null,null,null,null,null,null,null,null,null,3134,"Piliny","Nógrád"]
[null,null,null,null,null,null,null,null,null,null,null,null,null,null,null,null,null,null,null,null,2721,"Pilis","Pest"]
[null,null,null,null,null,null,null,null,null,null,null,null,null,null,null,null,null,null,null,null,2097,"Pilisborosjenő","Pest"]
[null,null,null,null,null,null,null,null,null,null,null,null,null,null,null,null,null,null,null,null,2087,"Piliscsaba","Pest"]
[null,null,null,null,null,null,null,null,null,null,null,null,null,null,null,null,null,null,null,null,2081,"Piliscsaba","Pest"]
[null,null,null,null,null,null,null,null,null,null,null,null,null,null,null,null,null,null,null,null,2519,"Piliscsév","Komárom-Esztergom"]
[null,null,null,null,null,null,null,null,null,null,null,null,null,null,null,null,null,null,null,null,2080,"Pilisjászfalu","Pest"]
[null,null,null,null,null,null,null,null,null,null,null,null,null,null,null,null,null,null,null,null,2028,"Pilismarót","Komárom-Esztergom"]
[null,null,null,null,null,null,null,null,null,null,null,null,null,null,null,null,null,null,null,null,2095,"Pilisszántó","Pest"]
[null,null,null,null,null,null,null,null,null,null,null,null,null,null,null,null,null,null,null,null,2084,"Pilisszentiván","Pest"]
[null,null,null,null,null,null,null,null,null,null,null,null,null,null,null,null,null,null,null,null,2099,"Pilisszentkereszt","Pest"]
[null,null,null,null,null,null,null,null,null,null,null,null,null,null,null,null,null,null,null,null,2098,"Pilisszentkereszt","Pest"]
[null,null,null,null,null,null,null,null,null,null,null,null,null,null,null,null,null,null,null,null,2009,"Pilisszentlászló","Pest"]
[null,null,null,null,null,null,null,null,null,null,null,null,null,null,null,null,null,null,null,null,2085,"Pilisvörösvár","Pest"]
[null,null,null,null,null,null,null,null,null,null,null,null,null,null,null,null,null,null,null,null,7084,"Pincehely","Tolna"]
[null,null,null,null,null,null,null,null,null,null,null,null,null,null,null,null,null,null,null,null,9922,"Pinkamindszent","Vas"]
[null,null,null,null,null,null,null,null,null,null,null,null,null,null,null,null,null,null,null,null,9481,"Pinnye","Győr-Moson-Sopron"]
[null,null,null,null,null,null,null,null,null,null,null,null,null,null,null,null,null,null,null,null,4375,"Piricse","Szabolcs-Szatmár-Bereg"]
[null,null,null,null,null,null,null,null,null,null,null,null,null,null,null,null,null,null,null,null,6414,"Pirtó","Bács-Kiskun"]
[null,null,null,null,null,null,null,null,null,null,null,null,null,null,null,null,null,null,null,null,7838,"Piskó","Baranya"]
[null,null,null,null,null,null,null,null,null,null,null,null,null,null,null,null,null,null,null,null,6914,"Pitvaros","Csongrád"]
[null,null,null,null,null,null,null,null,null,null,null,null,null,null,null,null,null,null,null,null,7756,"Pócsa","Baranya"]
[null,null,null,null,null,null,null,null,null,null,null,null,null,null,null,null,null,null,null,null,4125,"Pocsaj","Hajdú-Bihar"]
[null,null,null,null,null,null,null,null,null,null,null,null,null,null,null,null,null,null,null,null,2017,"Pócsmegyer","Pest"]
[null,null,null,null,null,null,null,null,null,null,null,null,null,null,null,null,null,null,null,null,4327,"Pócspetri","Szabolcs-Szatmár-Bereg"]
[null,null,null,null,null,null,null,null,null,null,null,null,null,null,null,null,null,null,null,null,7666,"Pogány","Baranya"]
[null,null,null,null,null,null,null,null,null,null,null,null,null,null,null,null,null,null,null,null,8728,"Pogányszentpéter","Somogy"]
[null,null,null,null,null,null,null,null,null,null,null,null,null,null,null,null,null,null,null,null,8932,"Pókaszepetk","Zala"]
[null,null,null,null,null,null,null,null,null,null,null,null,null,null,null,null,null,null,null,null,7458,"Polány","Somogy"]
[null,null,null,null,null,null,null,null,null,null,null,null,null,null,null,null,null,null,null,null,4090,"Polgár","Hajdú-Bihar"]
[null,null,null,null,null,null,null,null,null,null,null,null,null,null,null,null,null,null,null,null,8153,"Polgárdi","Fejér"]
[null,null,null,null,null,null,null,null,null,null,null,null,null,null,null,null,null,null,null,null,8155,"Polgárdi","Fejér"]
[null,null,null,null,null,null,null,null,null,null,null,null,null,null,null,null,null,null,null,null,8154,"Polgárdi","Fejér"]
[null,null,null,null,null,null,null,null,null,null,null,null,null,null,null,null,null,null,null,null,8929,"Pölöske","Pest"]
[null,null,null,null,null,null,null,null,null,null,null,null,null,null,null,null,null,null,null,null,8773,"Pölöskefő","Szabolcs-Szatmár-Bereg"]
[null,null,null,null,null,null,null,null,null,null,null,null,null,null,null,null,null,null,null,null,2013,"Pomáz","Vas"]
[null,null,null,null,null,null,null,null,null,null,null,null,null,null,null,null,null,null,null,null,7142,"Pörböly","Heves"]
[null,null,null,null,null,null,null,null,null,null,null,null,null,null,null,null,null,null,null,null,4761,"Porcsalma","Vas"]
[null,null,null,null,null,null,null,null,null,null,null,null,null,null,null,null,null,null,null,null,8956,"Pördefölde","Somogy"]
[null,null,null,null,null,null,null,null,null,null,null,null,null,null,null,null,null,null,null,null,9796,"Pornóapáti","Somogy"]
[null,null,null,null,null,null,null,null,null,null,null,null,null,null,null,null,null,null,null,null,3388,"Poroszló","Somogy"]
[null,null,null,null,null,null,null,null,null,null,null,null,null,null,null,null,null,null,null,null,9612,"Porpác","Zala"]
[null,null,null,null,null,null,null,null,null,null,null,null,null,null,null,null,null,null,null,null,8858,"Porrog","Veszprém"]
[null,null,null,null,null,null,null,null,null,null,null,null,null,null,null,null,null,null,null,null,8858,"Porrogszentkirály","Vas"]
[null,null,null,null,null,null,null,null,null,null,null,null,null,null,null,null,null,null,null,null,8858,"Porrogszentpál","Somogy"]
[null,null,null,null,null,null,null,null,null,null,null,null,null,null,null,null,null,null,null,null,8986,"Pórszombat","Győr-Moson-Sopron"]
[null,null,null,null,null,null,null,null,null,null,null,null,null,null,null,null,null,null,null,null,8429,"Porva","Zala"]
[null,null,null,null,null,null,null,null,null,null,null,null,null,null,null,null,null,null,null,null,9636,"Pósfa","Zala"]
[null,null,null,null,null,null,null,null,null,null,null,null,null,null,null,null,null,null,null,null,7977,"Potony","Tolna"]
[null,null,null,null,null,null,null,null,null,null,null,null,null,null,null,null,null,null,null,null,8767,"Pötréte","Zala"]
[null,null,null,null,null,null,null,null,null,null,null,null,null,null,null,null,null,null,null,null,9324,"Potyond","Zala"]
[null,null,null,null,null,null,null,null,null,null,null,null,null,null,null,null,null,null,null,null,3925,"Prügy","Borsod-Abaúj-Zemplén"]
[null,null,null,null,null,null,null,null,null,null,null,null,null,null,null,null,null,null,null,null,8291,"Pula","Veszprém"]
[null,null,null,null,null,null,null,null,null,null,null,null,null,null,null,null,null,null,null,null,9235,"Püski","Zala"]
[null,null,null,null,null,null,null,null,null,null,null,null,null,null,null,null,null,null,null,null,2682,"Püspökhatvan","Nógrád"]
[null,null,null,null,null,null,null,null,null,null,null,null,null,null,null,null,null,null,null,null,4150,"Püspökladány","Győr-Moson-Sopron"]
[null,null,null,null,null,null,null,null,null,null,null,null,null,null,null,null,null,null,null,null,9776,"Püspökmolnári","Vas"]
[null,null,null,null,null,null,null,null,null,null,null,null,null,null,null,null,null,null,null,null,2166,"Püspökszilágy","Szabolcs-Szatmár-Bereg"]
[null,null,null,null,null,null,null,null,null,null,null,null,null,null,null,null,null,null,null,null,8986,"Pusztaapáti","Zala"]
[null,null,null,null,null,null,null,null,null,null,null,null,null,null,null,null,null,null,null,null,2658,"Pusztaberki","Borsod-Abaúj-Zemplén"]
[null,null,null,null,null,null,null,null,null,null,null,null,null,null,null,null,null,null,null,null,9373,"Pusztacsalád","Békés"]
[null,null,null,null,null,null,null,null,null,null,null,null,null,null,null,null,null,null,null,null,9739,"Pusztacsó","Tolna"]
[null,null,null,null,null,null,null,null,null,null,null,null,null,null,null,null,null,null,null,null,4565,"Pusztadobos","Somogy"]
[null,null,null,null,null,null,null,null,null,null,null,null,null,null,null,null,null,null,null,null,8946,"Pusztaederics","Zala"]
[null,null,null,null,null,null,null,null,null,null,null,null,null,null,null,null,null,null,null,null,3995,"Pusztafalu","Csongrád"]
[null,null,null,null,null,null,null,null,null,null,null,null,null,null,null,null,null,null,null,null,5919,"Pusztaföldvár","Veszprém"]
[null,null,null,null,null,null,null,null,null,null,null,null,null,null,null,null,null,null,null,null,7038,"Pusztahencse","Jász-Nagykun-Szolnok"]
[null,null,null,null,null,null,null,null,null,null,null,null,null,null,null,null,null,null,null,null,8707,"Pusztakovácsi","Békés"]
[null,null,null,null,null,null,null,null,null,null,null,null,null,null,null,null,null,null,null,null,8895,"Pusztamagyaród","Borsod-Abaúj-Zemplén"]
[null,null,null,null,null,null,null,null,null,null,null,null,null,null,null,null,null,null,null,null,6785,"Pusztamérges","Fejér"]
[null,null,null,null,null,null,null,null,null,null,null,null,null,null,null,null,null,null,null,null,8455,"Pusztamiske","Somogy"]
[null,null,null,null,null,null,null,null,null,null,null,null,null,null,null,null,null,null,null,null,5125,"Pusztamonostor","Zala"]
[null,null,null,null,null,null,null,null,null,null,null,null,null,null,null,null,null,null,null,null,5665,"Pusztaottlaka","Csongrád"]
[null,null,null,null,null,null,null,null,null,null,null,null,null,null,null,null,null,null,null,null,3874,"Pusztaradvány","Pest"]
[null,null,null,null,null,null,null,null,null,null,null,null,null,null,null,null,null,null,null,null,2490,"Pusztaszabolcs","Fejér"]
[null,null,null,null,null,null,null,null,null,null,null,null,null,null,null,null,null,null,null,null,8619,"Pusztaszemes","Pest"]
[null,null,null,null,null,null,null,null,null,null,null,null,null,null,null,null,null,null,null,null,8896,"Pusztaszentlászló","Borsod-Abaúj-Zemplén"]
[null,null,null,null,null,null,null,null,null,null,null,null,null,null,null,null,null,null,null,null,6769,"Pusztaszer","Győr-Moson-Sopron"]
[null,null,null,null,null,null,null,null,null,null,null,null,null,null,null,null,null,null,null,null,2378,"Pusztavacs","Pest"]
[null,null,null,null,null,null,null,null,null,null,null,null,null,null,null,null,null,null,null,null,8066,"Pusztavám","Hajdú-Bihar"]
[null,null,null,null,null,null,null,null,null,null,null,null,null,null,null,null,null,null,null,null,2039,"Pusztazámor","Vas"]
[null,null,null,null,null,null,null,null,null,null,null,null,null,null,null,null,null,null,null,null,3630,"Putnok","Pest"]
[null,null,null,null,null,null,null,null,null,null,null,null,null,null,null,null,null,null,null,null,9313,"Rábacsanak","Győr-Moson-Sopron"]
[null,null,null,null,null,null,null,null,null,null,null,null,null,null,null,null,null,null,null,null,9136,"Rábacsécsény","Győr-Moson-Sopron"]
[null,null,null,null,null,null,null,null,null,null,null,null,null,null,null,null,null,null,null,null,9961,"Rábagyarmat","Vas"]
[null,null,null,null,null,null,null,null,null,null,null,null,null,null,null,null,null,null,null,null,9777,"Rábahidvég","Vas"]
[null,null,null,null,null,null,null,null,null,null,null,null,null,null,null,null,null,null,null,null,9344,"Rábakecöl","Győr-Moson-Sopron"]
[null,null,null,null,null,null,null,null,null,null,null,null,null,null,null,null,null,null,null,null,9142,"Rábapatona","Győr-Moson-Sopron"]
[null,null,null,null,null,null,null,null,null,null,null,null,null,null,null,null,null,null,null,null,9641,"Rábapaty","Vas"]
[null,null,null,null,null,null,null,null,null,null,null,null,null,null,null,null,null,null,null,null,9146,"Rábapordány","Győr-Moson-Sopron"]
[null,null,null,null,null,null,null,null,null,null,null,null,null,null,null,null,null,null,null,null,9327,"Rábasebes","Győr-Moson-Sopron"]
[null,null,null,null,null,null,null,null,null,null,null,null,null,null,null,null,null,null,null,null,9316,"Rábaszentandrás","Győr-Moson-Sopron"]
[null,null,null,null,null,null,null,null,null,null,null,null,null,null,null,null,null,null,null,null,9135,"Rábaszentmihály","Győr-Moson-Sopron"]
[null,null,null,null,null,null,null,null,null,null,null,null,null,null,null,null,null,null,null,null,9133,"Rábaszentmiklós","Győr-Moson-Sopron"]
[null,null,null,null,null,null,null,null,null,null,null,null,null,null,null,null,null,null,null,null,9322,"Rábatamási","Győr-Moson-Sopron"]
[null,null,null,null,null,null,null,null,null,null,null,null,null,null,null,null,null,null,null,null,9766,"Rábatöttös","Vas"]
[null,null,null,null,null,null,null,null,null,null,null,null,null,null,null,null,null,null,null,null,9165,"Rábcakapi","Győr-Moson-Sopron"]
[null,null,null,null,null,null,null,null,null,null,null,null,null,null,null,null,null,null,null,null,2459,"Rácalmás","Fejér"]
[null,null,null,null,null,null,null,null,null,null,null,null,null,null,null,null,null,null,null,null,2465,"Ráckeresztúr","Fejér"]
[null,null,null,null,null,null,null,null,null,null,null,null,null,null,null,null,null,null,null,null,2300,"Ráckeve","Pest"]
[null,null,null,null,null,null,null,null,null,null,null,null,null,null,null,null,null,null,null,null,2613,"Rád","Pest"]
[null,null,null,null,null,null,null,null,null,null,null,null,null,null,null,null,null,null,null,null,7817,"Rádfalva","Baranya"]
[null,null,null,null,null,null,null,null,null,null,null,null,null,null,null,null,null,null,null,null,9784,"Rádóckölked","Vas"]
[null,null,null,null,null,null,null,null,null,null,null,null,null,null,null,null,null,null,null,null,3776,"Radostyán","Borsod-Abaúj-Zemplén"]
[null,null,null,null,null,null,null,null,null,null,null,null,null,null,null,null,null,null,null,null,3724,"Ragály","Borsod-Abaúj-Zemplén"]
[null,null,null,null,null,null,null,null,null,null,null,null,null,null,null,null,null,null,null,null,9224,"Rajka","Győr-Moson-Sopron"]
[null,null,null,null,null,null,null,null,null,null,null,null,null,null,null,null,null,null,null,null,3825,"Rakaca","Borsod-Abaúj-Zemplén"]
[null,null,null,null,null,null,null,null,null,null,null,null,null,null,null,null,null,null,null,null,3826,"Rakacaszend","Borsod-Abaúj-Zemplén"]
[null,null,null,null,null,null,null,null,null,null,null,null,null,null,null,null,null,null,null,null,4465,"Rakamaz","Szabolcs-Szatmár-Bereg"]
[null,null,null,null,null,null,null,null,null,null,null,null,null,null,null,null,null,null,null,null,5085,"Rákóczifalva","Jász-Nagykun-Szolnok"]
[null,null,null,null,null,null,null,null,null,null,null,null,null,null,null,null,null,null,null,null,5084,"Rákócziújfalu","Jász-Nagykun-Szolnok"]
[null,null,null,null,null,null,null,null,null,null,null,null,null,null,null,null,null,null,null,null,7464,"Ráksi","Somogy"]
[null,null,null,null,null,null,null,null,null,null,null,null,null,null,null,null,null,null,null,null,8973,"Ramocsa","Zala"]
[null,null,null,null,null,null,null,null,null,null,null,null,null,null,null,null,null,null,null,null,4536,"Ramocsaháza","Szabolcs-Szatmár-Bereg"]
[null,null,null,null,null,null,null,null,null,null,null,null,null,null,null,null,null,null,null,null,4756,"Rápolt","Szabolcs-Szatmár-Bereg"]
[null,null,null,null,null,null,null,null,null,null,null,null,null,null,null,null,null,null,null,null,8300,"Raposka","Veszprém"]
[null,null,null,null,null,null,null,null,null,null,null,null,null,null,null,null,null,null,null,null,3833,"Rásonysápberencs","Borsod-Abaúj-Zemplén"]
[null,null,null,null,null,null,null,null,null,null,null,null,null,null,null,null,null,null,null,null,3908,"Rátka","Borsod-Abaúj-Zemplén"]
[null,null,null,null,null,null,null,null,null,null,null,null,null,null,null,null,null,null,null,null,9951,"Rátót","Vas"]
[null,null,null,null,null,null,null,null,null,null,null,null,null,null,null,null,null,null,null,null,9091,"Ravazd","Győr-Moson-Sopron"]
[null,null,null,null,null,null,null,null,null,null,null,null,null,null,null,null,null,null,null,null,3245,"Recsk","Heves"]
[null,null,null,null,null,null,null,null,null,null,null,null,null,null,null,null,null,null,null,null,2886,"Réde","Komárom-Esztergom"]
[null,null,null,null,null,null,null,null,null,null,null,null,null,null,null,null,null,null,null,null,8978,"Rédics","Zala"]
[null,null,null,null,null,null,null,null,null,null,null,null,null,null,null,null,null,null,null,null,3893,"Regéc","Borsod-Abaúj-Zemplén"]
[null,null,null,null,null,null,null,null,null,null,null,null,null,null,null,null,null,null,null,null,7833,"Regenye","Baranya"]
[null,null,null,null,null,null,null,null,null,null,null,null,null,null,null,null,null,null,null,null,7193,"Regöly","Tolna"]
[null,null,null,null,null,null,null,null,null,null,null,null,null,null,null,null,null,null,null,null,6446,"Rém","Bács-Kiskun"]
[null,null,null,null,null,null,null,null,null,null,null,null,null,null,null,null,null,null,null,null,2094,"Remeteszőlős","Pest"]
[null,null,null,null,null,null,null,null,null,null,null,null,null,null,null,null,null,null,null,null,3559,"Répáshuta","Borsod-Abaúj-Zemplén"]
[null,null,null,null,null,null,null,null,null,null,null,null,null,null,null,null,null,null,null,null,9653,"Répcelak","Vas"]
[null,null,null,null,null,null,null,null,null,null,null,null,null,null,null,null,null,null,null,null,9375,"Répceszemere","Győr-Moson-Sopron"]
[null,null,null,null,null,null,null,null,null,null,null,null,null,null,null,null,null,null,null,null,9623,"Répceszentgyörgy","Vas"]
[null,null,null,null,null,null,null,null,null,null,null,null,null,null,null,null,null,null,null,null,9475,"Répcevis","Győr-Moson-Sopron"]
[null,null,null,null,null,null,null,null,null,null,null,null,null,null,null,null,null,null,null,null,8977,"Resznek","Zala"]
[null,null,null,null,null,null,null,null,null,null,null,null,null,null,null,null,null,null,null,null,9074,"Rétalap","Győr-Moson-Sopron"]
[null,null,null,null,null,null,null,null,null,null,null,null,null,null,null,null,null,null,null,null,4525,"Rétközberencs","Szabolcs-Szatmár-Bereg"]
[null,null,null,null,null,null,null,null,null,null,null,null,null,null,null,null,null,null,null,null,2651,"Rétság","Nógrád"]
[null,null,null,null,null,null,null,null,null,null,null,null,null,null,null,null,null,null,null,null,8253,"Révfülöp","Veszprém"]
[null,null,null,null,null,null,null,null,null,null,null,null,null,null,null,null,null,null,null,null,3976,"Révleányvár","Borsod-Abaúj-Zemplén"]
[null,null,null,null,null,null,null,null,null,null,null,null,null,null,null,null,null,null,null,null,8373,"Rezi","Zala"]
[null,null,null,null,null,null,null,null,null,null,null,null,null,null,null,null,null,null,null,null,3974,"Ricse","Borsod-Abaúj-Zemplén"]
[null,null,null,null,null,null,null,null,null,null,null,null,null,null,null,null,null,null,null,null,8348,"Rigács","Veszprém"]
[null,null,null,null,null,null,null,null,null,null,null,null,null,null,null,null,null,null,null,null,8883,"Rigyác","Zala"]
[null,null,null,null,null,null,null,null,null,null,null,null,null,null,null,null,null,null,null,null,3177,"Rimóc","Nógrád"]
[null,null,null,null,null,null,null,null,null,null,null,null,null,null,null,null,null,null,null,null,7552,"Rinyabesenyő","Somogy"]
[null,null,null,null,null,null,null,null,null,null,null,null,null,null,null,null,null,null,null,null,7527,"Rinyakovácsi","Somogy"]
[null,null,null,null,null,null,null,null,null,null,null,null,null,null,null,null,null,null,null,null,7513,"Rinyaszentkirály","Somogy"]
[null,null,null,null,null,null,null,null,null,null,null,null,null,null,null,null,null,null,null,null,7556,"Rinyaújlak","Somogy"]
[null,null,null,null,null,null,null,null,null,null,null,null,null,null,null,null,null,null,null,null,7584,"Rinyaújnép","Somogy"]
[null,null,null,null,null,null,null,null,null,null,null,null,null,null,null,null,null,null,null,null,4563,"Rohod","Szabolcs-Szatmár-Bereg"]
[null,null,null,null,null,null,null,null,null,null,null,null,null,null,null,null,null,null,null,null,9451,"Röjtökmuzsaj","Veszprém"]
[null,null,null,null,null,null,null,null,null,null,null,null,null,null,null,null,null,null,null,null,8434,"Románd","Nógrád"]
[null,null,null,null,null,null,null,null,null,null,null,null,null,null,null,null,null,null,null,null,2654,"Romhány","Baranya"]
[null,null,null,null,null,null,null,null,null,null,null,null,null,null,null,null,null,null,null,null,7743,"Romonya","Baranya"]
[null,null,null,null,null,null,null,null,null,null,null,null,null,null,null,null,null,null,null,null,9954,"Rönök","Szabolcs-Szatmár-Bereg"]
[null,null,null,null,null,null,null,null,null,null,null,null,null,null,null,null,null,null,null,null,6758,"Röszke","Heves"]
[null,null,null,null,null,null,null,null,null,null,null,null,null,null,null,null,null,null,null,null,7914,"Rózsafa","Győr-Moson-Sopron"]
[null,null,null,null,null,null,null,null,null,null,null,null,null,null,null,null,null,null,null,null,4971,"Rozsály","Vas"]
[null,null,null,null,null,null,null,null,null,null,null,null,null,null,null,null,null,null,null,null,3033,"Rózsaszentmárton","Csongrád"]
[null,null,null,null,null,null,null,null,null,null,null,null,null,null,null,null,null,null,null,null,3733,"Rudabánya","Borsod-Abaúj-Zemplén"]
[null,null,null,null,null,null,null,null,null,null,null,null,null,null,null,null,null,null,null,null,3742,"Rudolftelep","Borsod-Abaúj-Zemplén"]
[null,null,null,null,null,null,null,null,null,null,null,null,null,null,null,null,null,null,null,null,9766,"Rum","Vas"]
[null,null,null,null,null,null,null,null,null,null,null,null,null,null,null,null,null,null,null,null,6786,"Ruzsa","Csongrád"]
[null,null,null,null,null,null,null,null,null,null,null,null,null,null,null,null,null,null,null,null,3162,"Ságújfalu","Nógrád"]
[null,null,null,null,null,null,null,null,null,null,null,null,null,null,null,null,null,null,null,null,8654,"Ságvár","Somogy"]
[null,null,null,null,null,null,null,null,null,null,null,null,null,null,null,null,null,null,null,null,3792,"Sajóbábony","Borsod-Abaúj-Zemplén"]
[null,null,null,null,null,null,null,null,null,null,null,null,null,null,null,null,null,null,null,null,3793,"Sajóecseg","Borsod-Abaúj-Zemplén"]
[null,null,null,null,null,null,null,null,null,null,null,null,null,null,null,null,null,null,null,null,3636,"Sajógalgóc","Borsod-Abaúj-Zemplén"]
[null,null,null,null,null,null,null,null,null,null,null,null,null,null,null,null,null,null,null,null,3576,"Sajóhidvég","Borsod-Abaúj-Zemplén"]
[null,null,null,null,null,null,null,null,null,null,null,null,null,null,null,null,null,null,null,null,3720,"Sajóivánka","Borsod-Abaúj-Zemplén"]
[null,null,null,null,null,null,null,null,null,null,null,null,null,null,null,null,null,null,null,null,3773,"Sajókápolna","Borsod-Abaúj-Zemplén"]
[null,null,null,null,null,null,null,null,null,null,null,null,null,null,null,null,null,null,null,null,3720,"Sajókaza","Borsod-Abaúj-Zemplén"]
[null,null,null,null,null,null,null,null,null,null,null,null,null,null,null,null,null,null,null,null,3791,"Sajókeresztúr","Borsod-Abaúj-Zemplén"]
[null,null,null,null,null,null,null,null,null,null,null,null,null,null,null,null,null,null,null,null,3572,"Sajólád","Borsod-Abaúj-Zemplén"]
[null,null,null,null,null,null,null,null,null,null,null,null,null,null,null,null,null,null,null,null,3773,"Sajólászlófalva","Borsod-Abaúj-Zemplén"]
[null,null,null,null,null,null,null,null,null,null,null,null,null,null,null,null,null,null,null,null,3656,"Sajómercse","Borsod-Abaúj-Zemplén"]
[null,null,null,null,null,null,null,null,null,null,null,null,null,null,null,null,null,null,null,null,3652,"Sajónémeti","Borsod-Abaúj-Zemplén"]
[null,null,null,null,null,null,null,null,null,null,null,null,null,null,null,null,null,null,null,null,3586,"Sajóörös","Borsod-Abaúj-Zemplén"]
[null,null,null,null,null,null,null,null,null,null,null,null,null,null,null,null,null,null,null,null,3714,"Sajópálfala","Borsod-Abaúj-Zemplén"]
[null,null,null,null,null,null,null,null,null,null,null,null,null,null,null,null,null,null,null,null,3573,"Sajópetri","Borsod-Abaúj-Zemplén"]
[null,null,null,null,null,null,null,null,null,null,null,null,null,null,null,null,null,null,null,null,3653,"Sajópüspöki","Borsod-Abaúj-Zemplén"]
[null,null,null,null,null,null,null,null,null,null,null,null,null,null,null,null,null,null,null,null,3712,"Sajósenye","Borsod-Abaúj-Zemplén"]
[null,null,null,null,null,null,null,null,null,null,null,null,null,null,null,null,null,null,null,null,3770,"Sajószentpéter","Borsod-Abaúj-Zemplén"]
[null,null,null,null,null,null,null,null,null,null,null,null,null,null,null,null,null,null,null,null,3599,"Sajószöged","Borsod-Abaúj-Zemplén"]
[null,null,null,null,null,null,null,null,null,null,null,null,null,null,null,null,null,null,null,null,3712,"Sajóvámos","Borsod-Abaúj-Zemplén"]
[null,null,null,null,null,null,null,null,null,null,null,null,null,null,null,null,null,null,null,null,3656,"Sajóvelezd","Borsod-Abaúj-Zemplén"]
[null,null,null,null,null,null,null,null,null,null,null,null,null,null,null,null,null,null,null,null,9632,"Sajtoskál","Vas"]
[null,null,null,null,null,null,null,null,null,null,null,null,null,null,null,null,null,null,null,null,8256,"Salföld","Veszprém"]
[null,null,null,null,null,null,null,null,null,null,null,null,null,null,null,null,null,null,null,null,3102,"Salgótarján","Nógrád"]
[null,null,null,null,null,null,null,null,null,null,null,null,null,null,null,null,null,null,null,null,3109,"Salgótarján","Nógrád"]
[null,null,null,null,null,null,null,null,null,null,null,null,null,null,null,null,null,null,null,null,3121,"Salgótarján","Nógrád"]
[null,null,null,null,null,null,null,null,null,null,null,null,null,null,null,null,null,null,null,null,3104,"Salgótarján","Nógrád"]
[null,null,null,null,null,null,null,null,null,null,null,null,null,null,null,null,null,null,null,null,3141,"Salgótarján","Nógrád"]
[null,null,null,null,null,null,null,null,null,null,null,null,null,null,null,null,null,null,null,null,3100,"Salgótarján","Nógrád"]
[null,null,null,null,null,null,null,null,null,null,null,null,null,null,null,null,null,null,null,null,9742,"Salköveskút","Vas"]
[null,null,null,null,null,null,null,null,null,null,null,null,null,null,null,null,null,null,null,null,8995,"Salomvár","Zala"]
[null,null,null,null,null,null,null,null,null,null,null,null,null,null,null,null,null,null,null,null,3425,"Sály","Borsod-Abaúj-Zemplén"]
[null,null,null,null,null,null,null,null,null,null,null,null,null,null,null,null,null,null,null,null,7841,"Sámod","Baranya"]
[null,null,null,null,null,null,null,null,null,null,null,null,null,null,null,null,null,null,null,null,3074,"Sámsonháza","Nógrád"]
[null,null,null,null,null,null,null,null,null,null,null,null,null,null,null,null,null,null,null,null,8824,"Sand","Zala"]
[null,null,null,null,null,null,null,null,null,null,null,null,null,null,null,null,null,null,null,null,6762,"Sándorfalva","Csongrád"]
[null,null,null,null,null,null,null,null,null,null,null,null,null,null,null,null,null,null,null,null,7479,"Sántos","Somogy"]
[null,null,null,null,null,null,null,null,null,null,null,null,null,null,null,null,null,null,null,null,4176,"Sáp","Hajdú-Bihar"]
[null,null,null,null,null,null,null,null,null,null,null,null,null,null,null,null,null,null,null,null,4272,"Sáránd","Hajdú-Bihar"]
[null,null,null,null,null,null,null,null,null,null,null,null,null,null,null,null,null,null,null,null,3942,"Sárazsadány","Borsod-Abaúj-Zemplén"]
[null,null,null,null,null,null,null,null,null,null,null,null,null,null,null,null,null,null,null,null,7018,"Sárbogárd","Fejér"]
[null,null,null,null,null,null,null,null,null,null,null,null,null,null,null,null,null,null,null,null,7019,"Sárbogárd","Fejér"]
[null,null,null,null,null,null,null,null,null,null,null,null,null,null,null,null,null,null,null,null,7003,"Sárbogárd","Fejér"]
[null,null,null,null,null,null,null,null,null,null,null,null,null,null,null,null,null,null,null,null,7000,"Sárbogárd","Fejér"]
[null,null,null,null,null,null,null,null,null,null,null,null,null,null,null,null,null,null,null,null,7014,"Sáregres","Fejér"]
[null,null,null,null,null,null,null,null,null,null,null,null,null,null,null,null,null,null,null,null,9813,"Sárfimizdó","Vas"]
[null,null,null,null,null,null,null,null,null,null,null,null,null,null,null,null,null,null,null,null,8944,"Sárhida","Zala"]
[null,null,null,null,null,null,null,null,null,null,null,null,null,null,null,null,null,null,null,null,2523,"Sárisáp","Komárom-Esztergom"]
[null,null,null,null,null,null,null,null,null,null,null,null,null,null,null,null,null,null,null,null,5720,"Sarkad","Békés"]
[null,null,null,null,null,null,null,null,null,null,null,null,null,null,null,null,null,null,null,null,5731,"Sarkadkeresztúr","Békés"]
[null,null,null,null,null,null,null,null,null,null,null,null,null,null,null,null,null,null,null,null,8051,"Sárkeresztes","Fejér"]
[null,null,null,null,null,null,null,null,null,null,null,null,null,null,null,null,null,null,null,null,8125,"Sárkeresztúr","Fejér"]
[null,null,null,null,null,null,null,null,null,null,null,null,null,null,null,null,null,null,null,null,8144,"Sárkeszi","Fejér"]
[null,null,null,null,null,null,null,null,null,null,null,null,null,null,null,null,null,null,null,null,8391,"Sármellék","Zala"]
[null,null,null,null,null,null,null,null,null,null,null,null,null,null,null,null,null,null,null,null,7781,"Sárok","Baranya"]
[null,null,null,null,null,null,null,null,null,null,null,null,null,null,null,null,null,null,null,null,2433,"Sárosd","Fejér"]
[null,null,null,null,null,null,null,null,null,null,null,null,null,null,null,null,null,null,null,null,3952,"Sárospatak","Borsod-Abaúj-Zemplén"]
[null,null,null,null,null,null,null,null,null,null,null,null,null,null,null,null,null,null,null,null,3950,"Sárospatak","Borsod-Abaúj-Zemplén"]
[null,null,null,null,null,null,null,null,null,null,null,null,null,null,null,null,null,null,null,null,7145,"Sárpilis","Tolna"]
[null,null,null,null,null,null,null,null,null,null,null,null,null,null,null,null,null,null,null,null,4171,"Sárrétudvari","Hajdú-Bihar"]
[null,null,null,null,null,null,null,null,null,null,null,null,null,null,null,null,null,null,null,null,9434,"Sarród","Győr-Moson-Sopron"]
[null,null,null,null,null,null,null,null,null,null,null,null,null,null,null,null,null,null,null,null,9435,"Sarród","Győr-Moson-Sopron"]
[null,null,null,null,null,null,null,null,null,null,null,null,null,null,null,null,null,null,null,null,8126,"Sárszentágota","Fejér"]
[null,null,null,null,null,null,null,null,null,null,null,null,null,null,null,null,null,null,null,null,7047,"Sárszentlőrinc","Tolna"]
[null,null,null,null,null,null,null,null,null,null,null,null,null,null,null,null,null,null,null,null,8141,"Sárszentmihály","Fejér"]
[null,null,null,null,null,null,null,null,null,null,null,null,null,null,null,null,null,null,null,null,8143,"Sárszentmihály","Fejér"]
[null,null,null,null,null,null,null,null,null,null,null,null,null,null,null,null,null,null,null,null,3386,"Sarud","Heves"]
[null,null,null,null,null,null,null,null,null,null,null,null,null,null,null,null,null,null,null,null,9609,"Sárvár","Vas"]
[null,null,null,null,null,null,null,null,null,null,null,null,null,null,null,null,null,null,null,null,9608,"Sárvár","Vas"]
[null,null,null,null,null,null,null,null,null,null,null,null,null,null,null,null,null,null,null,null,9600,"Sárvár","Vas"]
[null,null,null,null,null,null,null,null,null,null,null,null,null,null,null,null,null,null,null,null,7370,"Sásd","Baranya"]
[null,null,null,null,null,null,null,null,null,null,null,null,null,null,null,null,null,null,null,null,8308,"Sáska","Veszprém"]
[null,null,null,null,null,null,null,null,null,null,null,null,null,null,null,null,null,null,null,null,3659,"Sáta","Borsod-Abaúj-Zemplén"]
[null,null,null,null,null,null,null,null,null,null,null,null,null,null,null,null,null,null,null,null,3944,"Sátoraljaújhely","Borsod-Abaúj-Zemplén"]
[null,null,null,null,null,null,null,null,null,null,null,null,null,null,null,null,null,null,null,null,3945,"Sátoraljaújhely","Borsod-Abaúj-Zemplén"]
[null,null,null,null,null,null,null,null,null,null,null,null,null,null,null,null,null,null,null,null,3988,"Sátoraljaújhely","Borsod-Abaúj-Zemplén"]
[null,null,null,null,null,null,null,null,null,null,null,null,null,null,null,null,null,null,null,null,3980,"Sátoraljaújhely","Borsod-Abaúj-Zemplén"]
[null,null,null,null,null,null,null,null,null,null,null,null,null,null,null,null,null,null,null,null,7785,"Sátorhely","Baranya"]
[null,null,null,null,null,null,null,null,null,null,null,null,null,null,null,null,null,null,null,null,8732,"Sávoly","Somogy"]
[null,null,null,null,null,null,null,null,null,null,null,null,null,null,null,null,null,null,null,null,9789,"Sé","Vas"]
[null,null,null,null,null,null,null,null,null,null,null,null,null,null,null,null,null,null,null,null,7562,"Segesd","Somogy"]
[null,null,null,null,null,null,null,null,null,null,null,null,null,null,null,null,null,null,null,null,7960,"Sellye","Baranya"]
[null,null,null,null,null,null,null,null,null,null,null,null,null,null,null,null,null,null,null,null,3809,"Selyeb","Borsod-Abaúj-Zemplén"]
[null,null,null,null,null,null,null,null,null,null,null,null,null,null,null,null,null,null,null,null,3974,"Semjén","Borsod-Abaúj-Zemplén"]
[null,null,null,null,null,null,null,null,null,null,null,null,null,null,null,null,null,null,null,null,8862,"Semjénháza","Zala"]
[null,null,null,null,null,null,null,null,null,null,null,null,null,null,null,null,null,null,null,null,8788,"Sénye","Zala"]
[null,null,null,null,null,null,null,null,null,null,null,null,null,null,null,null,null,null,null,null,4533,"Sényő","Szabolcs-Szatmár-Bereg"]
[null,null,null,null,null,null,null,null,null,null,null,null,null,null,null,null,null,null,null,null,8111,"Seregélyes","Fejér"]
[null,null,null,null,null,null,null,null,null,null,null,null,null,null,null,null,null,null,null,null,3729,"Serényfalva","Borsod-Abaúj-Zemplén"]
[null,null,null,null,null,null,null,null,null,null,null,null,null,null,null,null,null,null,null,null,8660,"Sérsekszőlős","Somogy"]
[null,null,null,null,null,null,null,null,null,null,null,null,null,null,null,null,null,null,null,null,8439,"Sikátor","Veszprém"]
[null,null,null,null,null,null,null,null,null,null,null,null,null,null,null,null,null,null,null,null,7818,"Siklós","Baranya"]
[null,null,null,null,null,null,null,null,null,null,null,null,null,null,null,null,null,null,null,null,7800,"Siklós","Baranya"]
[null,null,null,null,null,null,null,null,null,null,null,null,null,null,null,null,null,null,null,null,7814,"Siklósbodony","Baranya"]
[null,null,null,null,null,null,null,null,null,null,null,null,null,null,null,null,null,null,null,null,7823,"Siklósnagyfalu","Baranya"]
[null,null,null,null,null,null,null,null,null,null,null,null,null,null,null,null,null,null,null,null,3881,"Sima","Borsod-Abaúj-Zemplén"]
[null,null,null,null,null,null,null,null,null,null,null,null,null,null,null,null,null,null,null,null,9633,"Simaság","Vas"]
[null,null,null,null,null,null,null,null,null,null,null,null,null,null,null,null,null,null,null,null,7474,"Simonfa","Somogy"]
[null,null,null,null,null,null,null,null,null,null,null,null,null,null,null,null,null,null,null,null,7081,"Simontornya","Tolna"]
[null,null,null,null,null,null,null,null,null,null,null,null,null,null,null,null,null,null,null,null,7171,"Sióagárd","Tolna"]
[null,null,null,null,null,null,null,null,null,null,null,null,null,null,null,null,null,null,null,null,8611,"Siófok","Somogy"]
[null,null,null,null,null,null,null,null,null,null,null,null,null,null,null,null,null,null,null,null,8609,"Siófok","Somogy"]
[null,null,null,null,null,null,null,null,null,null,null,null,null,null,null,null,null,null,null,null,8600,"Siófok","Somogy"]
[null,null,null,null,null,null,null,null,null,null,null,null,null,null,null,null,null,null,null,null,8652,"Siójut","Somogy"]
[null,null,null,null,null,null,null,null,null,null,null,null,null,null,null,null,null,null,null,null,3332,"Sirok","Heves"]
[null,null,null,null,null,null,null,null,null,null,null,null,null,null,null,null,null,null,null,null,9671,"Sitke","Vas"]
[null,null,null,null,null,null,null,null,null,null,null,null,null,null,null,null,null,null,null,null,9315,"Sobor","Győr-Moson-Sopron"]
[null,null,null,null,null,null,null,null,null,null,null,null,null,null,null,null,null,null,null,null,8897,"Söjtör","Győr-Moson-Sopron"]
[null,null,null,null,null,null,null,null,null,null,null,null,null,null,null,null,null,null,null,null,9112,"Sokorópátka","Bács-Kiskun"]
[null,null,null,null,null,null,null,null,null,null,null,null,null,null,null,null,null,null,null,null,6320,"Solt","Bács-Kiskun"]
[null,null,null,null,null,null,null,null,null,null,null,null,null,null,null,null,null,null,null,null,6223,"Soltszentimre","Bács-Kiskun"]
[null,null,null,null,null,null,null,null,null,null,null,null,null,null,null,null,null,null,null,null,6230,"Soltvadkert","Veszprém"]
[null,null,null,null,null,null,null,null,null,null,null,null,null,null,null,null,null,null,null,null,8193,"Sóly","Pest"]
[null,null,null,null,null,null,null,null,null,null,null,null,null,null,null,null,null,null,null,null,2083,"Solymár","Somogy"]
[null,null,null,null,null,null,null,null,null,null,null,null,null,null,null,null,null,null,null,null,8655,"Som","Baranya"]
[null,null,null,null,null,null,null,null,null,null,null,null,null,null,null,null,null,null,null,null,7728,"Somberek","Veszprém"]
[null,null,null,null,null,null,null,null,null,null,null,null,null,null,null,null,null,null,null,null,8478,"Somlójenő","Veszprém"]
[null,null,null,null,null,null,null,null,null,null,null,null,null,null,null,null,null,null,null,null,8483,"Somlószőlős","Veszprém"]
[null,null,null,null,null,null,null,null,null,null,null,null,null,null,null,null,null,null,null,null,8481,"Somlóvásárhely","Veszprém"]
[null,null,null,null,null,null,null,null,null,null,null,null,null,null,null,null,null,null,null,null,8484,"Somlóvecse","Somogy"]
[null,null,null,null,null,null,null,null,null,null,null,null,null,null,null,null,null,null,null,null,7454,"Somodor","Somogy"]
[null,null,null,null,null,null,null,null,null,null,null,null,null,null,null,null,null,null,null,null,7283,"Somogyacsa","Baranya"]
[null,null,null,null,null,null,null,null,null,null,null,null,null,null,null,null,null,null,null,null,7922,"Somogyapáti","Somogy"]
[null,null,null,null,null,null,null,null,null,null,null,null,null,null,null,null,null,null,null,null,7584,"Somogyaracs","Somogy"]
[null,null,null,null,null,null,null,null,null,null,null,null,null,null,null,null,null,null,null,null,7452,"Somogyaszaló","Somogy"]
[null,null,null,null,null,null,null,null,null,null,null,null,null,null,null,null,null,null,null,null,8684,"Somogybabod","Somogy"]
[null,null,null,null,null,null,null,null,null,null,null,null,null,null,null,null,null,null,null,null,8858,"Somogybükkösd","Somogy"]
[null,null,null,null,null,null,null,null,null,null,null,null,null,null,null,null,null,null,null,null,8726,"Somogycsicsó","Somogy"]
[null,null,null,null,null,null,null,null,null,null,null,null,null,null,null,null,null,null,null,null,7284,"Somogydöröcske","Somogy"]
[null,null,null,null,null,null,null,null,null,null,null,null,null,null,null,null,null,null,null,null,8666,"Somogyegres","Somogy"]
[null,null,null,null,null,null,null,null,null,null,null,null,null,null,null,null,null,null,null,null,8708,"Somogyfajsz","Somogy"]
[null,null,null,null,null,null,null,null,null,null,null,null,null,null,null,null,null,null,null,null,7455,"Somogygeszti","Baranya"]
[null,null,null,null,null,null,null,null,null,null,null,null,null,null,null,null,null,null,null,null,7925,"Somogyhárságy","Baranya"]
[null,null,null,null,null,null,null,null,null,null,null,null,null,null,null,null,null,null,null,null,7921,"Somogyhatvan","Somogy"]
[null,null,null,null,null,null,null,null,null,null,null,null,null,null,null,null,null,null,null,null,7443,"Somogyjád","Somogy"]
[null,null,null,null,null,null,null,null,null,null,null,null,null,null,null,null,null,null,null,null,8673,"Somogymeggyes","Somogy"]
[null,null,null,null,null,null,null,null,null,null,null,null,null,null,null,null,null,null,null,null,8733,"Somogysámson","Somogy"]
[null,null,null,null,null,null,null,null,null,null,null,null,null,null,null,null,null,null,null,null,7435,"Somogysárd","Somogy"]
[null,null,null,null,null,null,null,null,null,null,null,null,null,null,null,null,null,null,null,null,8737,"Somogysimonyi","Somogy"]
[null,null,null,null,null,null,null,null,null,null,null,null,null,null,null,null,null,null,null,null,8705,"Somogyszentpál","Somogy"]
[null,null,null,null,null,null,null,null,null,null,null,null,null,null,null,null,null,null,null,null,7276,"Somogyszil","Somogy"]
[null,null,null,null,null,null,null,null,null,null,null,null,null,null,null,null,null,null,null,null,7563,"Somogyszob","Somogy"]
[null,null,null,null,null,null,null,null,null,null,null,null,null,null,null,null,null,null,null,null,8683,"Somogytúr","Somogy"]
[null,null,null,null,null,null,null,null,null,null,null,null,null,null,null,null,null,null,null,null,7515,"Somogyudvarhely","Somogy"]
[null,null,null,null,null,null,null,null,null,null,null,null,null,null,null,null,null,null,null,null,8699,"Somogyvámos","Somogy"]
[null,null,null,null,null,null,null,null,null,null,null,null,null,null,null,null,null,null,null,null,8698,"Somogyvár","Baranya"]
[null,null,null,null,null,null,null,null,null,null,null,null,null,null,null,null,null,null,null,null,7924,"Somogyviszló","Somogy"]
[null,null,null,null,null,null,null,null,null,null,null,null,null,null,null,null,null,null,null,null,8734,"Somogyzsitfa","Szabolcs-Szatmár-Bereg"]
[null,null,null,null,null,null,null,null,null,null,null,null,null,null,null,null,null,null,null,null,4954,"Sonkád","Fejér"]
[null,null,null,null,null,null,null,null,null,null,null,null,null,null,null,null,null,null,null,null,8123,"Soponya","Győr-Moson-Sopron"]
[null,null,null,null,null,null,null,null,null,null,null,null,null,null,null,null,null,null,null,null,9494,"Sopron","Győr-Moson-Sopron"]
[null,null,null,null,null,null,null,null,null,null,null,null,null,null,null,null,null,null,null,null,9408,"Sopron","Győr-Moson-Sopron"]
[null,null,null,null,null,null,null,null,null,null,null,null,null,null,null,null,null,null,null,null,9407,"Sopron","Győr-Moson-Sopron"]
[null,null,null,null,null,null,null,null,null,null,null,null,null,null,null,null,null,null,null,null,9400,"Sopron","Győr-Moson-Sopron"]
[null,null,null,null,null,null,null,null,null,null,null,null,null,null,null,null,null,null,null,null,9463,"Sopronhorpács","Győr-Moson-Sopron"]
[null,null,null,null,null,null,null,null,null,null,null,null,null,null,null,null,null,null,null,null,9483,"Sopronkövesd","Győr-Moson-Sopron"]
[null,null,null,null,null,null,null,null,null,null,null,null,null,null,null,null,null,null,null,null,9325,"Sopronnémeti","Vas"]
[null,null,null,null,null,null,null,null,null,null,null,null,null,null,null,null,null,null,null,null,9743,"Söpte","Vas"]
[null,null,null,null,null,null,null,null,null,null,null,null,null,null,null,null,null,null,null,null,8072,"Söréd","Zala"]
[null,null,null,null,null,null,null,null,null,null,null,null,null,null,null,null,null,null,null,null,9774,"Sorkifalud","Vas"]
[null,null,null,null,null,null,null,null,null,null,null,null,null,null,null,null,null,null,null,null,9774,"Sorkikápolna","Nógrád"]
[null,null,null,null,null,null,null,null,null,null,null,null,null,null,null,null,null,null,null,null,8881,"Sormás","Pest"]
[null,null,null,null,null,null,null,null,null,null,null,null,null,null,null,null,null,null,null,null,9773,"Sorokpolány","Borsod-Abaúj-Zemplén"]
[null,null,null,null,null,null,null,null,null,null,null,null,null,null,null,null,null,null,null,null,3131,"Sóshartyán","Baranya"]
[null,null,null,null,null,null,null,null,null,null,null,null,null,null,null,null,null,null,null,null,2038,"Sóskút","Vas"]
[null,null,null,null,null,null,null,null,null,null,null,null,null,null,null,null,null,null,null,null,3716,"Sóstófalva","Zala"]
[null,null,null,null,null,null,null,null,null,null,null,null,null,null,null,null,null,null,null,null,7960,"Sósvertike","Vas"]
[null,null,null,null,null,null,null,null,null,null,null,null,null,null,null,null,null,null,null,null,9681,"Sótony","Fejér"]
[null,null,null,null,null,null,null,null,null,null,null,null,null,null,null,null,null,null,null,null,8096,"Sukoró","Fejér"]
[null,null,null,null,null,null,null,null,null,null,null,null,null,null,null,null,null,null,null,null,6346,"Sükösd","Baranya"]
[null,null,null,null,null,null,null,null,null,null,null,null,null,null,null,null,null,null,null,null,2242,"Sülysáp","Komárom-Esztergom"]
[null,null,null,null,null,null,null,null,null,null,null,null,null,null,null,null,null,null,null,null,2241,"Sülysáp","Zala"]
[null,null,null,null,null,null,null,null,null,null,null,null,null,null,null,null,null,null,null,null,8330,"Sümeg","Bács-Kiskun"]
[null,null,null,null,null,null,null,null,null,null,null,null,null,null,null,null,null,null,null,null,8357,"Sümegcsehi","Pest"]
[null,null,null,null,null,null,null,null,null,null,null,null,null,null,null,null,null,null,null,null,8351,"Sümegprága","Pest"]
[null,null,null,null,null,null,null,null,null,null,null,null,null,null,null,null,null,null,null,null,7960,"Sumony","Veszprém"]
[null,null,null,null,null,null,null,null,null,null,null,null,null,null,null,null,null,null,null,null,2889,"Súr","Zala"]
[null,null,null,null,null,null,null,null,null,null,null,null,null,null,null,null,null,null,null,null,8856,"Surd","Veszprém"]
[null,null,null,null,null,null,null,null,null,null,null,null,null,null,null,null,null,null,null,null,2543,"Süttő","Komárom-Esztergom"]
[null,null,null,null,null,null,null,null,null,null,null,null,null,null,null,null,null,null,null,null,8151,"Szabadbattyán","Fejér"]
[null,null,null,null,null,null,null,null,null,null,null,null,null,null,null,null,null,null,null,null,2432,"Szabadegyháza","Fejér"]
[null,null,null,null,null,null,null,null,null,null,null,null,null,null,null,null,null,null,null,null,8139,"Szabadhidvég","Fejér"]
[null,null,null,null,null,null,null,null,null,null,null,null,null,null,null,null,null,null,null,null,8138,"Szabadhidvég","Fejér"]
[null,null,null,null,null,null,null,null,null,null,null,null,null,null,null,null,null,null,null,null,7253,"Szabadi","Somogy"]
[null,null,null,null,null,null,null,null,null,null,null,null,null,null,null,null,null,null,null,null,5712,"Szabadkígyós","Békés"]
[null,null,null,null,null,null,null,null,null,null,null,null,null,null,null,null,null,null,null,null,6080,"Szabadszállás","Bács-Kiskun"]
[null,null,null,null,null,null,null,null,null,null,null,null,null,null,null,null,null,null,null,null,7951,"Szabadszentkirály","Baranya"]
[null,null,null,null,null,null,null,null,null,null,null,null,null,null,null,null,null,null,null,null,7544,"Szabás","Somogy"]
[null,null,null,null,null,null,null,null,null,null,null,null,null,null,null,null,null,null,null,null,4467,"Szabolcs","Szabolcs-Szatmár-Bereg"]
[null,null,null,null,null,null,null,null,null,null,null,null,null,null,null,null,null,null,null,null,4547,"Szabolcsbáka","Szabolcs-Szatmár-Bereg"]
[null,null,null,null,null,null,null,null,null,null,null,null,null,null,null,null,null,null,null,null,4496,"Szabolcsveresmart","Szabolcs-Szatmár-Bereg"]
[null,null,null,null,null,null,null,null,null,null,null,null,null,null,null,null,null,null,null,null,2111,"Szada","Pest"]
[null,null,null,null,null,null,null,null,null,null,null,null,null,null,null,null,null,null,null,null,7383,"Szágy","Baranya"]
[null,null,null,null,null,null,null,null,null,null,null,null,null,null,null,null,null,null,null,null,7753,"Szajk","Baranya"]
[null,null,null,null,null,null,null,null,null,null,null,null,null,null,null,null,null,null,null,null,3334,"Szajla","Heves"]
[null,null,null,null,null,null,null,null,null,null,null,null,null,null,null,null,null,null,null,null,5081,"Szajol","Jász-Nagykun-Szolnok"]
[null,null,null,null,null,null,null,null,null,null,null,null,null,null,null,null,null,null,null,null,3786,"Szakácsi","Borsod-Abaúj-Zemplén"]
[null,null,null,null,null,null,null,null,null,null,null,null,null,null,null,null,null,null,null,null,7071,"Szakadát","Tolna"]
[null,null,null,null,null,null,null,null,null,null,null,null,null,null,null,null,null,null,null,null,3596,"Szakáld","Borsod-Abaúj-Zemplén"]
[null,null,null,null,null,null,null,null,null,null,null,null,null,null,null,null,null,null,null,null,7192,"Szakály","Tolna"]
[null,null,null,null,null,null,null,null,null,null,null,null,null,null,null,null,null,null,null,null,7213,"Szakcs","Tolna"]
[null,null,null,null,null,null,null,null,null,null,null,null,null,null,null,null,null,null,null,null,6336,"Szakmár","Bács-Kiskun"]
[null,null,null,null,null,null,null,null,null,null,null,null,null,null,null,null,null,null,null,null,9934,"Szaknyér","Vas"]
[null,null,null,null,null,null,null,null,null,null,null,null,null,null,null,null,null,null,null,null,4234,"Szakoly","Szabolcs-Szatmár-Bereg"]
[null,null,null,null,null,null,null,null,null,null,null,null,null,null,null,null,null,null,null,null,9474,"Szakony","Győr-Moson-Sopron"]
[null,null,null,null,null,null,null,null,null,null,null,null,null,null,null,null,null,null,null,null,9983,"Szakonyfalu","Vas"]
[null,null,null,null,null,null,null,null,null,null,null,null,null,null,null,null,null,null,null,null,2856,"Szákszend","Komárom-Esztergom"]
[null,null,null,null,null,null,null,null,null,null,null,null,null,null,null,null,null,null,null,null,9942,"Szalafő","Vas"]
[null,null,null,null,null,null,null,null,null,null,null,null,null,null,null,null,null,null,null,null,7811,"Szalánta","Baranya"]
[null,null,null,null,null,null,null,null,null,null,null,null,null,null,null,null,null,null,null,null,8341,"Szalapa","Zala"]
[null,null,null,null,null,null,null,null,null,null,null,null,null,null,null,null,null,null,null,null,3863,"Szalaszend","Borsod-Abaúj-Zemplén"]
[null,null,null,null,null,null,null,null,null,null,null,null,null,null,null,null,null,null,null,null,7334,"Szalatnak","Baranya"]
[null,null,null,null,null,null,null,null,null,null,null,null,null,null,null,null,null,null,null,null,7121,"Szálka","Tolna"]
[null,null,null,null,null,null,null,null,null,null,null,null,null,null,null,null,null,null,null,null,6086,"Szalkszentmárton","Bács-Kiskun"]
[null,null,null,null,null,null,null,null,null,null,null,null,null,null,null,null,null,null,null,null,3163,"Szalmatercs","Nógrád"]
[null,null,null,null,null,null,null,null,null,null,null,null,null,null,null,null,null,null,null,null,3754,"Szalonna","Borsod-Abaúj-Zemplén"]
[null,null,null,null,null,null,null,null,null,null,null,null,null,null,null,null,null,null,null,null,4767,"Szamosangyalos","Szabolcs-Szatmár-Bereg"]
[null,null,null,null,null,null,null,null,null,null,null,null,null,null,null,null,null,null,null,null,4745,"Szamosbecs","Szabolcs-Szatmár-Bereg"]
[null,null,null,null,null,null,null,null,null,null,null,null,null,null,null,null,null,null,null,null,4721,"Szamoskér","Szabolcs-Szatmár-Bereg"]
[null,null,null,null,null,null,null,null,null,null,null,null,null,null,null,null,null,null,null,null,4735,"Szamossályi","Szabolcs-Szatmár-Bereg"]
[null,null,null,null,null,null,null,null,null,null,null,null,null,null,null,null,null,null,null,null,4824,"Szamosszeg","Szabolcs-Szatmár-Bereg"]
[null,null,null,null,null,null,null,null,null,null,null,null,null,null,null,null,null,null,null,null,4746,"Szamostatárfalva","Szabolcs-Szatmár-Bereg"]
[null,null,null,null,null,null,null,null,null,null,null,null,null,null,null,null,null,null,null,null,4734,"Szamosújlak","Szabolcs-Szatmár-Bereg"]
[null,null,null,null,null,null,null,null,null,null,null,null,null,null,null,null,null,null,null,null,2697,"Szanda","Nógrád"]
[null,null,null,null,null,null,null,null,null,null,null,null,null,null,null,null,null,null,null,null,6131,"Szank","Bács-Kiskun"]
[null,null,null,null,null,null,null,null,null,null,null,null,null,null,null,null,null,null,null,null,8622,"Szántód","Somogy"]
[null,null,null,null,null,null,null,null,null,null,null,null,null,null,null,null,null,null,null,null,9317,"Szany","Győr-Moson-Sopron"]
[null,null,null,null,null,null,null,null,null,null,null,null,null,null,null,null,null,null,null,null,8423,"Szápár","Veszprém"]
[null,null,null,null,null,null,null,null,null,null,null,null,null,null,null,null,null,null,null,null,7843,"Szaporca","Baranya"]
[null,null,null,null,null,null,null,null,null,null,null,null,null,null,null,null,null,null,null,null,2066,"Szár","Fejér"]
[null,null,null,null,null,null,null,null,null,null,null,null,null,null,null,null,null,null,null,null,7184,"Szárász","Baranya"]
[null,null,null,null,null,null,null,null,null,null,null,null,null,null,null,null,null,null,null,null,7063,"Szárazd","Tolna"]
[null,null,null,null,null,null,null,null,null,null,null,null,null,null,null,null,null,null,null,null,9353,"Szárföld","Győr-Moson-Sopron"]
[null,null,null,null,null,null,null,null,null,null,null,null,null,null,null,null,null,null,null,null,2067,"Szárliget","Komárom-Esztergom"]
[null,null,null,null,null,null,null,null,null,null,null,null,null,null,null,null,null,null,null,null,5540,"Szarvas","Békés"]
[null,null,null,null,null,null,null,null,null,null,null,null,null,null,null,null,null,null,null,null,3051,"Szarvasgede","Nógrád"]
[null,null,null,null,null,null,null,null,null,null,null,null,null,null,null,null,null,null,null,null,9913,"Szarvaskend","Vas"]
[null,null,null,null,null,null,null,null,null,null,null,null,null,null,null,null,null,null,null,null,5053,"Szászberek","Jász-Nagykun-Szolnok"]
[null,null,null,null,null,null,null,null,null,null,null,null,null,null,null,null,null,null,null,null,3821,"Szászfa","Borsod-Abaúj-Zemplén"]
[null,null,null,null,null,null,null,null,null,null,null,null,null,null,null,null,null,null,null,null,7349,"Szászvár","Baranya"]
[null,null,null,null,null,null,null,null,null,null,null,null,null,null,null,null,null,null,null,null,4945,"Szatmárcseke","Szabolcs-Szatmár-Bereg"]
[null,null,null,null,null,null,null,null,null,null,null,null,null,null,null,null,null,null,null,null,2656,"Szátok","Nógrád"]
[null,null,null,null,null,null,null,null,null,null,null,null,null,null,null,null,null,null,null,null,9938,"Szatta","Vas"]
[null,null,null,null,null,null,null,null,null,null,null,null,null,null,null,null,null,null,null,null,6763,"Szatymaz","Csongrád"]
[null,null,null,null,null,null,null,null,null,null,null,null,null,null,null,null,null,null,null,null,7813,"Szava","Baranya"]
[null,null,null,null,null,null,null,null,null,null,null,null,null,null,null,null,null,null,null,null,2440,"Százhalombatta","Pest"]
[null,null,null,null,null,null,null,null,null,null,null,null,null,null,null,null,null,null,null,null,7725,"Szebény","Baranya"]
[null,null,null,null,null,null,null,null,null,null,null,null,null,null,null,null,null,null,null,null,2692,"Szécsénke","Nógrád"]
[null,null,null,null,null,null,null,null,null,null,null,null,null,null,null,null,null,null,null,null,3170,"Szécsény","Nógrád"]
[null,null,null,null,null,null,null,null,null,null,null,null,null,null,null,null,null,null,null,null,3135,"Szécsényfelfalu","Nógrád"]
[null,null,null,null,null,null,null,null,null,null,null,null,null,null,null,null,null,null,null,null,8879,"Szécsisziget","Zala"]
[null,null,null,null,null,null,null,null,null,null,null,null,null,null,null,null,null,null,null,null,7751,"Szederkény","Baranya"]
[null,null,null,null,null,null,null,null,null,null,null,null,null,null,null,null,null,null,null,null,7056,"Szedres","Tolna"]
[null,null,null,null,null,null,null,null,null,null,null,null,null,null,null,null,null,null,null,null,6757,"Szeged","Csongrád"]
[null,null,null,null,null,null,null,null,null,null,null,null,null,null,null,null,null,null,null,null,6791,"Szeged","Csongrád"]
[null,null,null,null,null,null,null,null,null,null,null,null,null,null,null,null,null,null,null,null,6710,"Szeged","Csongrád"]
[null,null,null,null,null,null,null,null,null,null,null,null,null,null,null,null,null,null,null,null,6771,"Szeged","Csongrád"]
[null,null,null,null,null,null,null,null,null,null,null,null,null,null,null,null,null,null,null,null,6753,"Szeged","Csongrád"]
[null,null,null,null,null,null,null,null,null,null,null,null,null,null,null,null,null,null,null,null,6700,"Szeged","Csongrád"]
[null,null,null,null,null,null,null,null,null,null,null,null,null,null,null,null,null,null,null,null,6720,"Szeged","Csongrád"]
[null,null,null,null,null,null,null,null,null,null,null,null,null,null,null,null,null,null,null,null,6721,"Szeged","Csongrád"]
[null,null,null,null,null,null,null,null,null,null,null,null,null,null,null,null,null,null,null,null,6722,"Szeged","Csongrád"]
[null,null,null,null,null,null,null,null,null,null,null,null,null,null,null,null,null,null,null,null,6723,"Szeged","Csongrád"]
[null,null,null,null,null,null,null,null,null,null,null,null,null,null,null,null,null,null,null,null,6724,"Szeged","Csongrád"]
[null,null,null,null,null,null,null,null,null,null,null,null,null,null,null,null,null,null,null,null,6725,"Szeged","Csongrád"]
[null,null,null,null,null,null,null,null,null,null,null,null,null,null,null,null,null,null,null,null,6726,"Szeged","Csongrád"]
[null,null,null,null,null,null,null,null,null,null,null,null,null,null,null,null,null,null,null,null,6727,"Szeged","Csongrád"]
[null,null,null,null,null,null,null,null,null,null,null,null,null,null,null,null,null,null,null,null,6728,"Szeged","Csongrád"]
[null,null,null,null,null,null,null,null,null,null,null,null,null,null,null,null,null,null,null,null,6729,"Szeged","Csongrád"]
[null,null,null,null,null,null,null,null,null,null,null,null,null,null,null,null,null,null,null,null,8732,"Szegerdő","Somogy"]
[null,null,null,null,null,null,null,null,null,null,null,null,null,null,null,null,null,null,null,null,5520,"Szeghalom","Békés"]
[null,null,null,null,null,null,null,null,null,null,null,null,null,null,null,null,null,null,null,null,3918,"Szegi","Borsod-Abaúj-Zemplén"]
[null,null,null,null,null,null,null,null,null,null,null,null,null,null,null,null,null,null,null,null,3918,"Szegilong","Borsod-Abaúj-Zemplén"]
[null,null,null,null,null,null,null,null,null,null,null,null,null,null,null,null,null,null,null,null,6635,"Szegvár","Csongrád"]
[null,null,null,null,null,null,null,null,null,null,null,null,null,null,null,null,null,null,null,null,4534,"Székely","Szabolcs-Szatmár-Bereg"]
[null,null,null,null,null,null,null,null,null,null,null,null,null,null,null,null,null,null,null,null,7737,"Székelyszabar","Baranya"]
[null,null,null,null,null,null,null,null,null,null,null,null,null,null,null,null,null,null,null,null,8019,"Székesfehérvár","Fejér"]
[null,null,null,null,null,null,null,null,null,null,null,null,null,null,null,null,null,null,null,null,8000,"Székesfehérvár","Fejér"]
[null,null,null,null,null,null,null,null,null,null,null,null,null,null,null,null,null,null,null,null,6821,"Székkutas","Csongrád"]
[null,null,null,null,null,null,null,null,null,null,null,null,null,null,null,null,null,null,null,null,7100,"Szekszárd","Tolna"]
[null,null,null,null,null,null,null,null,null,null,null,null,null,null,null,null,null,null,null,null,9622,"Szeleste","Vas"]
[null,null,null,null,null,null,null,null,null,null,null,null,null,null,null,null,null,null,null,null,5476,"Szelevény","Jász-Nagykun-Szolnok"]
[null,null,null,null,null,null,null,null,null,null,null,null,null,null,null,null,null,null,null,null,7661,"Szellő","Baranya"]
[null,null,null,null,null,null,null,null,null,null,null,null,null,null,null,null,null,null,null,null,7763,"Szemely","Baranya"]
[null,null,null,null,null,null,null,null,null,null,null,null,null,null,null,null,null,null,null,null,9685,"Szemenye","Vas"]
[null,null,null,null,null,null,null,null,null,null,null,null,null,null,null,null,null,null,null,null,3866,"Szemere","Borsod-Abaúj-Zemplén"]
[null,null,null,null,null,null,null,null,null,null,null,null,null,null,null,null,null,null,null,null,2640,"Szendehely","Nógrád"]
[null,null,null,null,null,null,null,null,null,null,null,null,null,null,null,null,null,null,null,null,3752,"Szendrő","Borsod-Abaúj-Zemplén"]
[null,null,null,null,null,null,null,null,null,null,null,null,null,null,null,null,null,null,null,null,3751,"Szendrőlád","Borsod-Abaúj-Zemplén"]
[null,null,null,null,null,null,null,null,null,null,null,null,null,null,null,null,null,null,null,null,7477,"Szenna","Somogy"]
[null,null,null,null,null,null,null,null,null,null,null,null,null,null,null,null,null,null,null,null,8849,"Szenta","Somogy"]
[null,null,null,null,null,null,null,null,null,null,null,null,null,null,null,null,null,null,null,null,8272,"Szentantalfa","Veszprém"]
[null,null,null,null,null,null,null,null,null,null,null,null,null,null,null,null,null,null,null,null,7472,"Szentbalázs","Somogy"]
[null,null,null,null,null,null,null,null,null,null,null,null,null,null,null,null,null,null,null,null,8281,"Szentbékkálla","Veszprém"]
[null,null,null,null,null,null,null,null,null,null,null,null,null,null,null,null,null,null,null,null,7918,"Szentborbás","Somogy"]
[null,null,null,null,null,null,null,null,null,null,null,null,null,null,null,null,null,null,null,null,7913,"Szentdénes","Baranya"]
[null,null,null,null,null,null,null,null,null,null,null,null,null,null,null,null,null,null,null,null,3259,"Szentdomonkos","Heves"]
[null,null,null,null,null,null,null,null,null,null,null,null,null,null,null,null,null,null,null,null,2655,"Szente","Nógrád"]
[null,null,null,null,null,null,null,null,null,null,null,null,null,null,null,null,null,null,null,null,7915,"Szentegát","Baranya"]
[null,null,null,null,null,null,null,null,null,null,null,null,null,null,null,null,null,null,null,null,2000,"Szentendre","Pest"]
[null,null,null,null,null,null,null,null,null,null,null,null,null,null,null,null,null,null,null,null,6600,"Szentes","Csongrád"]
[null,null,null,null,null,null,null,null,null,null,null,null,null,null,null,null,null,null,null,null,8444,"Szentgál","Veszprém"]
[null,null,null,null,null,null,null,null,null,null,null,null,null,null,null,null,null,null,null,null,7465,"Szentgáloskér","Somogy"]
[null,null,null,null,null,null,null,null,null,null,null,null,null,null,null,null,null,null,null,null,9981,"Szentgotthárd","Vas"]
[null,null,null,null,null,null,null,null,null,null,null,null,null,null,null,null,null,null,null,null,9955,"Szentgotthárd","Vas"]
[null,null,null,null,null,null,null,null,null,null,null,null,null,null,null,null,null,null,null,null,9970,"Szentgotthárd","Vas"]
[null,null,null,null,null,null,null,null,null,null,null,null,null,null,null,null,null,null,null,null,8393,"Szentgyörgyvár","Zala"]
[null,null,null,null,null,null,null,null,null,null,null,null,null,null,null,null,null,null,null,null,8975,"Szentgyörgyvölgy","Zala"]
[null,null,null,null,null,null,null,null,null,null,null,null,null,null,null,null,null,null,null,null,8475,"Szentimrefalva","Veszprém"]
[null,null,null,null,null,null,null,null,null,null,null,null,null,null,null,null,null,null,null,null,3418,"Szentistván","Borsod-Abaúj-Zemplén"]
[null,null,null,null,null,null,null,null,null,null,null,null,null,null,null,null,null,null,null,null,3844,"Szentistvánbaksa","Borsod-Abaúj-Zemplén"]
[null,null,null,null,null,null,null,null,null,null,null,null,null,null,null,null,null,null,null,null,8272,"Szentjakabfa","Veszprém"]
[null,null,null,null,null,null,null,null,null,null,null,null,null,null,null,null,null,null,null,null,7681,"Szentkatalin","Baranya"]
[null,null,null,null,null,null,null,null,null,null,null,null,null,null,null,null,null,null,null,null,6031,"Szentkirály","Bács-Kiskun"]
[null,null,null,null,null,null,null,null,null,null,null,null,null,null,null,null,null,null,null,null,8225,"Szentkirályszabadja","Veszprém"]
[null,null,null,null,null,null,null,null,null,null,null,null,null,null,null,null,null,null,null,null,8947,"Szentkozmadombja","Zala"]
[null,null,null,null,null,null,null,null,null,null,null,null,null,null,null,null,null,null,null,null,7936,"Szentlászló","Baranya"]
[null,null,null,null,null,null,null,null,null,null,null,null,null,null,null,null,null,null,null,null,8893,"Szentliszló","Zala"]
[null,null,null,null,null,null,null,null,null,null,null,null,null,null,null,null,null,null,null,null,7940,"Szentlőrinc","Baranya"]
[null,null,null,null,null,null,null,null,null,null,null,null,null,null,null,null,null,null,null,null,2255,"Szentlőrinckáta","Pest"]
[null,null,null,null,null,null,null,null,null,null,null,null,null,null,null,null,null,null,null,null,8872,"Szentmargitfalva","Zala"]
[null,null,null,null,null,null,null,null,null,null,null,null,null,null,null,null,null,null,null,null,2254,"Szentmártonkáta","Pest"]
[null,null,null,null,null,null,null,null,null,null,null,null,null,null,null,null,null,null,null,null,9799,"Szentpéterfa","Vas"]
[null,null,null,null,null,null,null,null,null,null,null,null,null,null,null,null,null,null,null,null,8953,"Szentpéterfölde","Zala"]
[null,null,null,null,null,null,null,null,null,null,null,null,null,null,null,null,null,null,null,null,4121,"Szentpéterszeg","Hajdú-Bihar"]
[null,null,null,null,null,null,null,null,null,null,null,null,null,null,null,null,null,null,null,null,8762,"Szentpéterúr","Zala"]
[null,null,null,null,null,null,null,null,null,null,null,null,null,null,null,null,null,null,null,null,8717,"Szenyér","Somogy"]
[null,null,null,null,null,null,null,null,null,null,null,null,null,null,null,null,null,null,null,null,8861,"Szepetnek","Zala"]
[null,null,null,null,null,null,null,null,null,null,null,null,null,null,null,null,null,null,null,null,9125,"Szerecseny","Győr-Moson-Sopron"]
[null,null,null,null,null,null,null,null,null,null,null,null,null,null,null,null,null,null,null,null,6512,"Szeremle","Bács-Kiskun"]
[null,null,null,null,null,null,null,null,null,null,null,null,null,null,null,null,null,null,null,null,3900,"Szerencs","Borsod-Abaúj-Zemplén"]
[null,null,null,null,null,null,null,null,null,null,null,null,null,null,null,null,null,null,null,null,4162,"Szerep","Hajdú-Bihar"]
[null,null,null,null,null,null,null,null,null,null,null,null,null,null,null,null,null,null,null,null,4163,"Szerep","Hajdú-Bihar"]
[null,null,null,null,null,null,null,null,null,null,null,null,null,null,null,null,null,null,null,null,9523,"Szergény","Vas"]
[null,null,null,null,null,null,null,null,null,null,null,null,null,null,null,null,null,null,null,null,2321,"Szigetbecse","Pest"]
[null,null,null,null,null,null,null,null,null,null,null,null,null,null,null,null,null,null,null,null,2317,"Szigetcsép","Pest"]
[null,null,null,null,null,null,null,null,null,null,null,null,null,null,null,null,null,null,null,null,2315,"Szigethalom","Pest"]
[null,null,null,null,null,null,null,null,null,null,null,null,null,null,null,null,null,null,null,null,2015,"Szigetmonostor","Pest"]
[null,null,null,null,null,null,null,null,null,null,null,null,null,null,null,null,null,null,null,null,2318,"Szigetszentmárton","Pest"]
[null,null,null,null,null,null,null,null,null,null,null,null,null,null,null,null,null,null,null,null,2310,"Szigetszentmiklós","Pest"]
[null,null,null,null,null,null,null,null,null,null,null,null,null,null,null,null,null,null,null,null,2319,"Szigetújfalu","Pest"]
[null,null,null,null,null,null,null,null,null,null,null,null,null,null,null,null,null,null,null,null,7900,"Szigetvár","Baranya"]
[null,null,null,null,null,null,null,null,null,null,null,null,null,null,null,null,null,null,null,null,8264,"Szigliget","Veszprém"]
[null,null,null,null,null,null,null,null,null,null,null,null,null,null,null,null,null,null,null,null,3377,"Szihalom","Heves"]
[null,null,null,null,null,null,null,null,null,null,null,null,null,null,null,null,null,null,null,null,8969,"Szijártóháza","Zala"]
[null,null,null,null,null,null,null,null,null,null,null,null,null,null,null,null,null,null,null,null,3800,"Szikszó","Borsod-Abaúj-Zemplén"]
[null,null,null,null,null,null,null,null,null,null,null,null,null,null,null,null,null,null,null,null,9326,"Szil","Győr-Moson-Sopron"]
[null,null,null,null,null,null,null,null,null,null,null,null,null,null,null,null,null,null,null,null,7664,"Szilágy","Baranya"]
[null,null,null,null,null,null,null,null,null,null,null,null,null,null,null,null,null,null,null,null,3125,"Szilaspogony","Nógrád"]
[null,null,null,null,null,null,null,null,null,null,null,null,null,null,null,null,null,null,null,null,9312,"Szilsárkány","Győr-Moson-Sopron"]
[null,null,null,null,null,null,null,null,null,null,null,null,null,null,null,null,null,null,null,null,8986,"Szilvágy","Zala"]
[null,null,null,null,null,null,null,null,null,null,null,null,null,null,null,null,null,null,null,null,7811,"Szilvás","Baranya"]
[null,null,null,null,null,null,null,null,null,null,null,null,null,null,null,null,null,null,null,null,7477,"Szilvásszentmárton","Heves"]
[null,null,null,null,null,null,null,null,null,null,null,null,null,null,null,null,null,null,null,null,3348,"Szilvásvárad","Somogy"]
[null,null,null,null,null,null,null,null,null,null,null,null,null,null,null,null,null,null,null,null,3761,"Szin","Borsod-Abaúj-Zemplén"]
[null,null,null,null,null,null,null,null,null,null,null,null,null,null,null,null,null,null,null,null,3761,"Szinpetri","Borsod-Abaúj-Zemplén"]
[null,null,null,null,null,null,null,null,null,null,null,null,null,null,null,null,null,null,null,null,3044,"Szirák","Nógrád"]
[null,null,null,null,null,null,null,null,null,null,null,null,null,null,null,null,null,null,null,null,3711,"Szirmabesenyő","Borsod-Abaúj-Zemplén"]
[null,null,null,null,null,null,null,null,null,null,null,null,null,null,null,null,null,null,null,null,2628,"Szob","Pest"]
[null,null,null,null,null,null,null,null,null,null,null,null,null,null,null,null,null,null,null,null,8452,"Szőc","Pest"]
[null,null,null,null,null,null,null,null,null,null,null,null,null,null,null,null,null,null,null,null,9935,"Szőce","Somogy"]
[null,null,null,null,null,null,null,null,null,null,null,null,null,null,null,null,null,null,null,null,2134,"Sződ","Jász-Nagykun-Szolnok"]
[null,null,null,null,null,null,null,null,null,null,null,null,null,null,null,null,null,null,null,null,2133,"Sződliget","Jász-Nagykun-Szolnok"]
[null,null,null,null,null,null,null,null,null,null,null,null,null,null,null,null,null,null,null,null,3762,"Szögliget","Vas"]
[null,null,null,null,null,null,null,null,null,null,null,null,null,null,null,null,null,null,null,null,7833,"Szőke","Vas"]
[null,null,null,null,null,null,null,null,null,null,null,null,null,null,null,null,null,null,null,null,7763,"Szőkéd","Vas"]
[null,null,null,null,null,null,null,null,null,null,null,null,null,null,null,null,null,null,null,null,8736,"Szőkedencs","Komárom-Esztergom"]
[null,null,null,null,null,null,null,null,null,null,null,null,null,null,null,null,null,null,null,null,2624,"Szokolya","Borsod-Abaúj-Zemplén"]
[null,null,null,null,null,null,null,null,null,null,null,null,null,null,null,null,null,null,null,null,8625,"Szólád","Komárom-Esztergom"]
[null,null,null,null,null,null,null,null,null,null,null,null,null,null,null,null,null,null,null,null,5008,"Szolnok","Somogy"]
[null,null,null,null,null,null,null,null,null,null,null,null,null,null,null,null,null,null,null,null,5000,"Szolnok","Veszprém"]
[null,null,null,null,null,null,null,null,null,null,null,null,null,null,null,null,null,null,null,null,3757,"Szőlősardó","Vas"]
[null,null,null,null,null,null,null,null,null,null,null,null,null,null,null,null,null,null,null,null,8692,"Szőlősgyörök","Pest"]
[null,null,null,null,null,null,null,null,null,null,null,null,null,null,null,null,null,null,null,null,9707,"Szombathely","Pest"]
[null,null,null,null,null,null,null,null,null,null,null,null,null,null,null,null,null,null,null,null,9719,"Szombathely","Borsod-Abaúj-Zemplén"]
[null,null,null,null,null,null,null,null,null,null,null,null,null,null,null,null,null,null,null,null,9700,"Szombathely","Baranya"]
[null,null,null,null,null,null,null,null,null,null,null,null,null,null,null,null,null,null,null,null,2896,"Szomód","Baranya"]
[null,null,null,null,null,null,null,null,null,null,null,null,null,null,null,null,null,null,null,null,3411,"Szomolya","Somogy"]
[null,null,null,null,null,null,null,null,null,null,null,null,null,null,null,null,null,null,null,null,2822,"Szomor","Borsod-Abaúj-Zemplén"]
[null,null,null,null,null,null,null,null,null,null,null,null,null,null,null,null,null,null,null,null,7976,"Szörény","Somogy"]
[null,null,null,null,null,null,null,null,null,null,null,null,null,null,null,null,null,null,null,null,7285,"Szorosad","Baranya"]
[null,null,null,null,null,null,null,null,null,null,null,null,null,null,null,null,null,null,null,null,3341,"Szúcs","Heves"]
[null,null,null,null,null,null,null,null,null,null,null,null,null,null,null,null,null,null,null,null,3034,"Szűcsi","Nógrád"]
[null,null,null,null,null,null,null,null,null,null,null,null,null,null,null,null,null,null,null,null,2699,"Szügy","Borsod-Abaúj-Zemplén"]
[null,null,null,null,null,null,null,null,null,null,null,null,null,null,null,null,null,null,null,null,3154,"Szuha","Borsod-Abaúj-Zemplén"]
[null,null,null,null,null,null,null,null,null,null,null,null,null,null,null,null,null,null,null,null,3726,"Szuhafő","Borsod-Abaúj-Zemplén"]
[null,null,null,null,null,null,null,null,null,null,null,null,null,null,null,null,null,null,null,null,3731,"Szuhakálló","Baranya"]
[null,null,null,null,null,null,null,null,null,null,null,null,null,null,null,null,null,null,null,null,3734,"Szuhogy","Somogy"]
[null,null,null,null,null,null,null,null,null,null,null,null,null,null,null,null,null,null,null,null,7932,"Szulimán","Nógrád"]
[null,null,null,null,null,null,null,null,null,null,null,null,null,null,null,null,null,null,null,null,7539,"Szulok","Heves"]
[null,null,null,null,null,null,null,null,null,null,null,null,null,null,null,null,null,null,null,null,7735,"Szűr","Nógrád"]
[null,null,null,null,null,null,null,null,null,null,null,null,null,null,null,null,null,null,null,null,3064,"Szurdokpüspöki","Baranya"]
[null,null,null,null,null,null,null,null,null,null,null,null,null,null,null,null,null,null,null,null,8660,"Tab","Somogy"]
[null,null,null,null,null,null,null,null,null,null,null,null,null,null,null,null,null,null,null,null,8088,"Tabajd","Fejér"]
[null,null,null,null,null,null,null,null,null,null,null,null,null,null,null,null,null,null,null,null,6224,"Tabdi","Bács-Kiskun"]
[null,null,null,null,null,null,null,null,null,null,null,null,null,null,null,null,null,null,null,null,2381,"Táborfalva","Pest"]
[null,null,null,null,null,null,null,null,null,null,null,null,null,null,null,null,null,null,null,null,8121,"Tác","Fejér"]
[null,null,null,null,null,null,null,null,null,null,null,null,null,null,null,null,null,null,null,null,8272,"Tagyon","Veszprém"]
[null,null,null,null,null,null,null,null,null,null,null,null,null,null,null,null,null,null,null,null,2022,"Tahitótfalu","Pest"]
[null,null,null,null,null,null,null,null,null,null,null,null,null,null,null,null,null,null,null,null,2021,"Tahitótfalu","Pest"]
[null,null,null,null,null,null,null,null,null,null,null,null,null,null,null,null,null,null,null,null,8541,"Takácsi","Veszprém"]
[null,null,null,null,null,null,null,null,null,null,null,null,null,null,null,null,null,null,null,null,4845,"Tákos","Szabolcs-Szatmár-Bereg"]
[null,null,null,null,null,null,null,null,null,null,null,null,null,null,null,null,null,null,null,null,2335,"Taksony","Pest"]
[null,null,null,null,null,null,null,null,null,null,null,null,null,null,null,null,null,null,null,null,3926,"Taktabáj","Borsod-Abaúj-Zemplén"]
[null,null,null,null,null,null,null,null,null,null,null,null,null,null,null,null,null,null,null,null,3922,"Taktaharkány","Borsod-Abaúj-Zemplén"]
[null,null,null,null,null,null,null,null,null,null,null,null,null,null,null,null,null,null,null,null,3924,"Taktakenéz","Borsod-Abaúj-Zemplén"]
[null,null,null,null,null,null,null,null,null,null,null,null,null,null,null,null,null,null,null,null,3921,"Taktaszada","Borsod-Abaúj-Zemplén"]
[null,null,null,null,null,null,null,null,null,null,null,null,null,null,null,null,null,null,null,null,8295,"Taliándörögd","Veszprém"]
[null,null,null,null,null,null,null,null,null,null,null,null,null,null,null,null,null,null,null,null,3907,"Tállya","Borsod-Abaúj-Zemplén"]
[null,null,null,null,null,null,null,null,null,null,null,null,null,null,null,null,null,null,null,null,7091,"Tamási","Tolna"]
[null,null,null,null,null,null,null,null,null,null,null,null,null,null,null,null,null,null,null,null,7090,"Tamási","Tolna"]
[null,null,null,null,null,null,null,null,null,null,null,null,null,null,null,null,null,null,null,null,9762,"Tanakajd","Vas"]
[null,null,null,null,null,null,null,null,null,null,null,null,null,null,null,null,null,null,null,null,9095,"Táp","Győr-Moson-Sopron"]
[null,null,null,null,null,null,null,null,null,null,null,null,null,null,null,null,null,null,null,null,2764,"Tápióbicske","Pest"]
[null,null,null,null,null,null,null,null,null,null,null,null,null,null,null,null,null,null,null,null,2767,"Tápiógyörgye","Pest"]
[null,null,null,null,null,null,null,null,null,null,null,null,null,null,null,null,null,null,null,null,2253,"Tápióság","Pest"]
[null,null,null,null,null,null,null,null,null,null,null,null,null,null,null,null,null,null,null,null,2251,"Tápiószecső","Pest"]
[null,null,null,null,null,null,null,null,null,null,null,null,null,null,null,null,null,null,null,null,2766,"Tápiószele","Pest"]
[null,null,null,null,null,null,null,null,null,null,null,null,null,null,null,null,null,null,null,null,2711,"Tápiószentmárton","Pest"]
[null,null,null,null,null,null,null,null,null,null,null,null,null,null,null,null,null,null,null,null,2769,"Tápiószőlős","Pest"]
[null,null,null,null,null,null,null,null,null,null,null,null,null,null,null,null,null,null,null,null,9761,"Táplánszentkereszt","Vas"]
[null,null,null,null,null,null,null,null,null,null,null,null,null,null,null,null,null,null,null,null,8297,"Tapolca","Veszprém"]
[null,null,null,null,null,null,null,null,null,null,null,null,null,null,null,null,null,null,null,null,8300,"Tapolca","Veszprém"]
[null,null,null,null,null,null,null,null,null,null,null,null,null,null,null,null,null,null,null,null,8718,"Tapsony","Somogy"]
[null,null,null,null,null,null,null,null,null,null,null,null,null,null,null,null,null,null,null,null,9094,"Tápszentmiklós","Győr-Moson-Sopron"]
[null,null,null,null,null,null,null,null,null,null,null,null,null,null,null,null,null,null,null,null,3073,"Tar","Nógrád"]
[null,null,null,null,null,null,null,null,null,null,null,null,null,null,null,null,null,null,null,null,7514,"Tarany","Somogy"]
[null,null,null,null,null,null,null,null,null,null,null,null,null,null,null,null,null,null,null,null,3915,"Tarcal","Borsod-Abaúj-Zemplén"]
[null,null,null,null,null,null,null,null,null,null,null,null,null,null,null,null,null,null,null,null,3416,"Tard","Borsod-Abaúj-Zemplén"]
[null,null,null,null,null,null,null,null,null,null,null,null,null,null,null,null,null,null,null,null,3644,"Tardona","Borsod-Abaúj-Zemplén"]
[null,null,null,null,null,null,null,null,null,null,null,null,null,null,null,null,null,null,null,null,2834,"Tardos","Komárom-Esztergom"]
[null,null,null,null,null,null,null,null,null,null,null,null,null,null,null,null,null,null,null,null,5641,"Tarhos","Békés"]
[null,null,null,null,null,null,null,null,null,null,null,null,null,null,null,null,null,null,null,null,2831,"Tarján","Komárom-Esztergom"]
[null,null,null,null,null,null,null,null,null,null,null,null,null,null,null,null,null,null,null,null,9092,"Tarjánpuszta","Győr-Moson-Sopron"]
[null,null,null,null,null,null,null,null,null,null,null,null,null,null,null,null,null,null,null,null,2945,"Tárkány","Komárom-Esztergom"]
[null,null,null,null,null,null,null,null,null,null,null,null,null,null,null,null,null,null,null,null,3369,"Tarnabod","Heves"]
[null,null,null,null,null,null,null,null,null,null,null,null,null,null,null,null,null,null,null,null,3258,"Tarnalelesz","Heves"]
[null,null,null,null,null,null,null,null,null,null,null,null,null,null,null,null,null,null,null,null,3284,"Tarnaméra","Heves"]
[null,null,null,null,null,null,null,null,null,null,null,null,null,null,null,null,null,null,null,null,3294,"Tarnaörs","Heves"]
[null,null,null,null,null,null,null,null,null,null,null,null,null,null,null,null,null,null,null,null,3331,"Tarnaszentmária","Heves"]
[null,null,null,null,null,null,null,null,null,null,null,null,null,null,null,null,null,null,null,null,3382,"Tarnaszentmiklós","Heves"]
[null,null,null,null,null,null,null,null,null,null,null,null,null,null,null,null,null,null,null,null,3283,"Tarnazsadány","Heves"]
[null,null,null,null,null,null,null,null,null,null,null,null,null,null,null,null,null,null,null,null,2461,"Tárnok","Pest"]
[null,null,null,null,null,null,null,null,null,null,null,null,null,null,null,null,null,null,null,null,9165,"Tárnokréti","Győr-Moson-Sopron"]
[null,null,null,null,null,null,null,null,null,null,null,null,null,null,null,null,null,null,null,null,4931,"Tarpa","Szabolcs-Szatmár-Bereg"]
[null,null,null,null,null,null,null,null,null,null,null,null,null,null,null,null,null,null,null,null,7362,"Tarrós","Baranya"]
[null,null,null,null,null,null,null,null,null,null,null,null,null,null,null,null,null,null,null,null,8696,"Táska","Somogy"]
[null,null,null,null,null,null,null,null,null,null,null,null,null,null,null,null,null,null,null,null,6098,"Tass","Bács-Kiskun"]
[null,null,null,null,null,null,null,null,null,null,null,null,null,null,null,null,null,null,null,null,7261,"Taszár","Somogy"]
[null,null,null,null,null,null,null,null,null,null,null,null,null,null,null,null,null,null,null,null,2534,"Tát","Komárom-Esztergom"]
[null,null,null,null,null,null,null,null,null,null,null,null,null,null,null,null,null,null,null,null,2835,"Tata","Komárom-Esztergom"]
[null,null,null,null,null,null,null,null,null,null,null,null,null,null,null,null,null,null,null,null,2890,"Tata","Komárom-Esztergom"]
[null,null,null,null,null,null,null,null,null,null,null,null,null,null,null,null,null,null,null,null,2800,"Tatabánya","Komárom-Esztergom"]
[null,null,null,null,null,null,null,null,null,null,null,null,null,null,null,null,null,null,null,null,6451,"Tataháza","Bács-Kiskun"]
[null,null,null,null,null,null,null,null,null,null,null,null,null,null,null,null,null,null,null,null,2375,"Tatárszentgyörgy","Pest"]
[null,null,null,null,null,null,null,null,null,null,null,null,null,null,null,null,null,null,null,null,6236,"Tázlár","Bács-Kiskun"]
[null,null,null,null,null,null,null,null,null,null,null,null,null,null,null,null,null,null,null,null,4243,"Téglás","Hajdú-Bihar"]
[null,null,null,null,null,null,null,null,null,null,null,null,null,null,null,null,null,null,null,null,7381,"Tékes","Baranya"]
[null,null,null,null,null,null,null,null,null,null,null,null,null,null,null,null,null,null,null,null,7973,"Teklafalu","Baranya"]
[null,null,null,null,null,null,null,null,null,null,null,null,null,null,null,null,null,null,null,null,9812,"Telekes","Vas"]
[null,null,null,null,null,null,null,null,null,null,null,null,null,null,null,null,null,null,null,null,5675,"Telekgerendás","Békés"]
[null,null,null,null,null,null,null,null,null,null,null,null,null,null,null,null,null,null,null,null,8626,"Teleki","Somogy"]
[null,null,null,null,null,null,null,null,null,null,null,null,null,null,null,null,null,null,null,null,2089,"Telki","Pest"]
[null,null,null,null,null,null,null,null,null,null,null,null,null,null,null,null,null,null,null,null,3896,"Telkibánya","Borsod-Abaúj-Zemplén"]
[null,null,null,null,null,null,null,null,null,null,null,null,null,null,null,null,null,null,null,null,7054,"Tengelic","Tolna"]
[null,null,null,null,null,null,null,null,null,null,null,null,null,null,null,null,null,null,null,null,7834,"Tengeri","Baranya"]
[null,null,null,null,null,null,null,null,null,null,null,null,null,null,null,null,null,null,null,null,8668,"Tengőd","Somogy"]
[null,null,null,null,null,null,null,null,null,null,null,null,null,null,null,null,null,null,null,null,3359,"Tenk","Heves"]
[null,null,null,null,null,null,null,null,null,null,null,null,null,null,null,null,null,null,null,null,9111,"Tényő","Győr-Moson-Sopron"]
[null,null,null,null,null,null,null,null,null,null,null,null,null,null,null,null,null,null,null,null,4132,"Tépe","Hajdú-Bihar"]
[null,null,null,null,null,null,null,null,null,null,null,null,null,null,null,null,null,null,null,null,4342,"Terem","Szabolcs-Szatmár-Bereg"]
[null,null,null,null,null,null,null,null,null,null,null,null,null,null,null,null,null,null,null,null,2696,"Terény","Nógrád"]
[null,null,null,null,null,null,null,null,null,null,null,null,null,null,null,null,null,null,null,null,2652,"Tereske","Nógrád"]
[null,null,null,null,null,null,null,null,null,null,null,null,null,null,null,null,null,null,null,null,3757,"Teresztenye","Borsod-Abaúj-Zemplén"]
[null,null,null,null,null,null,null,null,null,null,null,null,null,null,null,null,null,null,null,null,3334,"Terpes","Heves"]
[null,null,null,null,null,null,null,null,null,null,null,null,null,null,null,null,null,null,null,null,8109,"Tés","Veszprém"]
[null,null,null,null,null,null,null,null,null,null,null,null,null,null,null,null,null,null,null,null,2635,"Tésa","Pest"]
[null,null,null,null,null,null,null,null,null,null,null,null,null,null,null,null,null,null,null,null,7843,"Tésenfa","Baranya"]
[null,null,null,null,null,null,null,null,null,null,null,null,null,null,null,null,null,null,null,null,7834,"Téseny","Baranya"]
[null,null,null,null,null,null,null,null,null,null,null,null,null,null,null,null,null,null,null,null,8991,"Teskánd","Zala"]
[null,null,null,null,null,null,null,null,null,null,null,null,null,null,null,null,null,null,null,null,9100,"Tét","Győr-Moson-Sopron"]
[null,null,null,null,null,null,null,null,null,null,null,null,null,null,null,null,null,null,null,null,4184,"Tetétlen","Hajdú-Bihar"]
[null,null,null,null,null,null,null,null,null,null,null,null,null,null,null,null,null,null,null,null,7181,"Tevel","Tolna"]
[null,null,null,null,null,null,null,null,null,null,null,null,null,null,null,null,null,null,null,null,3423,"Tibolddaróc","Borsod-Abaúj-Zemplén"]
[null,null,null,null,null,null,null,null,null,null,null,null,null,null,null,null,null,null,null,null,4353,"Tiborszállás","Szabolcs-Szatmár-Bereg"]
[null,null,null,null,null,null,null,null,null,null,null,null,null,null,null,null,null,null,null,null,8237,"Tihany","Veszprém"]
[null,null,null,null,null,null,null,null,null,null,null,null,null,null,null,null,null,null,null,null,8731,"Tikos","Somogy"]
[null,null,null,null,null,null,null,null,null,null,null,null,null,null,null,null,null,null,null,null,8782,"Tilaj","Zala"]
[null,null,null,null,null,null,null,null,null,null,null,null,null,null,null,null,null,null,null,null,4466,"Timár","Szabolcs-Szatmár-Bereg"]
[null,null,null,null,null,null,null,null,null,null,null,null,null,null,null,null,null,null,null,null,2086,"Tinnye","Pest"]
[null,null,null,null,null,null,null,null,null,null,null,null,null,null,null,null,null,null,null,null,4833,"Tiszaadony","Szabolcs-Szatmár-Bereg"]
[null,null,null,null,null,null,null,null,null,null,null,null,null,null,null,null,null,null,null,null,6066,"Tiszaalpár","Bács-Kiskun"]
[null,null,null,null,null,null,null,null,null,null,null,null,null,null,null,null,null,null,null,null,6067,"Tiszaalpár","Bács-Kiskun"]
[null,null,null,null,null,null,null,null,null,null,null,null,null,null,null,null,null,null,null,null,3465,"Tiszabábolna","Borsod-Abaúj-Zemplén"]
[null,null,null,null,null,null,null,null,null,null,null,null,null,null,null,null,null,null,null,null,4951,"Tiszabecs","Szabolcs-Szatmár-Bereg"]
[null,null,null,null,null,null,null,null,null,null,null,null,null,null,null,null,null,null,null,null,4474,"Tiszabercel","Szabolcs-Szatmár-Bereg"]
[null,null,null,null,null,null,null,null,null,null,null,null,null,null,null,null,null,null,null,null,4624,"Tiszabezdéd","Szabolcs-Szatmár-Bereg"]
[null,null,null,null,null,null,null,null,null,null,null,null,null,null,null,null,null,null,null,null,5232,"Tiszabő","Jász-Nagykun-Szolnok"]
[null,null,null,null,null,null,null,null,null,null,null,null,null,null,null,null,null,null,null,null,5235,"Tiszabura","Jász-Nagykun-Szolnok"]
[null,null,null,null,null,null,null,null,null,null,null,null,null,null,null,null,null,null,null,null,4947,"Tiszacsécse","Szabolcs-Szatmár-Bereg"]
[null,null,null,null,null,null,null,null,null,null,null,null,null,null,null,null,null,null,null,null,4066,"Tiszacsege","Hajdú-Bihar"]
[null,null,null,null,null,null,null,null,null,null,null,null,null,null,null,null,null,null,null,null,3972,"Tiszacsermely","Borsod-Abaúj-Zemplén"]
[null,null,null,null,null,null,null,null,null,null,null,null,null,null,null,null,null,null,null,null,4455,"Tiszadada","Szabolcs-Szatmár-Bereg"]
[null,null,null,null,null,null,null,null,null,null,null,null,null,null,null,null,null,null,null,null,5243,"Tiszaderzs","Jász-Nagykun-Szolnok"]
[null,null,null,null,null,null,null,null,null,null,null,null,null,null,null,null,null,null,null,null,4456,"Tiszadob","Szabolcs-Szatmár-Bereg"]
[null,null,null,null,null,null,null,null,null,null,null,null,null,null,null,null,null,null,null,null,3466,"Tiszadorogma","Borsod-Abaúj-Zemplén"]
[null,null,null,null,null,null,null,null,null,null,null,null,null,null,null,null,null,null,null,null,4446,"Tiszaeszlár","Szabolcs-Szatmár-Bereg"]
[null,null,null,null,null,null,null,null,null,null,null,null,null,null,null,null,null,null,null,null,4464,"Tiszaeszlár","Szabolcs-Szatmár-Bereg"]
[null,null,null,null,null,null,null,null,null,null,null,null,null,null,null,null,null,null,null,null,5461,"Tiszaföldvár","Jász-Nagykun-Szolnok"]
[null,null,null,null,null,null,null,null,null,null,null,null,null,null,null,null,null,null,null,null,5430,"Tiszaföldvár","Jász-Nagykun-Szolnok"]
[null,null,null,null,null,null,null,null,null,null,null,null,null,null,null,null,null,null,null,null,5359,"Tiszafüred","Jász-Nagykun-Szolnok"]
[null,null,null,null,null,null,null,null,null,null,null,null,null,null,null,null,null,null,null,null,5358,"Tiszafüred","Jász-Nagykun-Szolnok"]
[null,null,null,null,null,null,null,null,null,null,null,null,null,null,null,null,null,null,null,null,5244,"Tiszafüred","Jász-Nagykun-Szolnok"]
[null,null,null,null,null,null,null,null,null,null,null,null,null,null,null,null,null,null,null,null,5350,"Tiszafüred","Jász-Nagykun-Szolnok"]
[null,null,null,null,null,null,null,null,null,null,null,null,null,null,null,null,null,null,null,null,5233,"Tiszagyenda","Jász-Nagykun-Szolnok"]
[null,null,null,null,null,null,null,null,null,null,null,null,null,null,null,null,null,null,null,null,4097,"Tiszagyulaháza","Hajdú-Bihar"]
[null,null,null,null,null,null,null,null,null,null,null,null,null,null,null,null,null,null,null,null,5361,"Tiszaigar","Jász-Nagykun-Szolnok"]
[null,null,null,null,null,null,null,null,null,null,null,null,null,null,null,null,null,null,null,null,5464,"Tiszainoka","Jász-Nagykun-Szolnok"]
[null,null,null,null,null,null,null,null,null,null,null,null,null,null,null,null,null,null,null,null,5094,"Tiszajenő","Jász-Nagykun-Szolnok"]
[null,null,null,null,null,null,null,null,null,null,null,null,null,null,null,null,null,null,null,null,4493,"Tiszakanyár","Szabolcs-Szatmár-Bereg"]
[null,null,null,null,null,null,null,null,null,null,null,null,null,null,null,null,null,null,null,null,3971,"Tiszakarád","Borsod-Abaúj-Zemplén"]
[null,null,null,null,null,null,null,null,null,null,null,null,null,null,null,null,null,null,null,null,6062,"Tiszakécske","Bács-Kiskun"]
[null,null,null,null,null,null,null,null,null,null,null,null,null,null,null,null,null,null,null,null,6060,"Tiszakécske","Bács-Kiskun"]
[null,null,null,null,null,null,null,null,null,null,null,null,null,null,null,null,null,null,null,null,4834,"Tiszakerecseny","Szabolcs-Szatmár-Bereg"]
[null,null,null,null,null,null,null,null,null,null,null,null,null,null,null,null,null,null,null,null,3458,"Tiszakeszi","Borsod-Abaúj-Zemplén"]
[null,null,null,null,null,null,null,null,null,null,null,null,null,null,null,null,null,null,null,null,4946,"Tiszakóród","Szabolcs-Szatmár-Bereg"]
[null,null,null,null,null,null,null,null,null,null,null,null,null,null,null,null,null,null,null,null,5472,"Tiszakürt","Jász-Nagykun-Szolnok"]
[null,null,null,null,null,null,null,null,null,null,null,null,null,null,null,null,null,null,null,null,5471,"Tiszakürt","Jász-Nagykun-Szolnok"]
[null,null,null,null,null,null,null,null,null,null,null,null,null,null,null,null,null,null,null,null,3929,"Tiszaladány","Borsod-Abaúj-Zemplén"]
[null,null,null,null,null,null,null,null,null,null,null,null,null,null,null,null,null,null,null,null,4447,"Tiszalök","Szabolcs-Szatmár-Bereg"]
[null,null,null,null,null,null,null,null,null,null,null,null,null,null,null,null,null,null,null,null,4450,"Tiszalök","Szabolcs-Szatmár-Bereg"]
[null,null,null,null,null,null,null,null,null,null,null,null,null,null,null,null,null,null,null,null,3565,"Tiszalúc","Borsod-Abaúj-Zemplén"]
[null,null,null,null,null,null,null,null,null,null,null,null,null,null,null,null,null,null,null,null,4645,"Tiszamogyorós","Szabolcs-Szatmár-Bereg"]
[null,null,null,null,null,null,null,null,null,null,null,null,null,null,null,null,null,null,null,null,4463,"Tiszanagyfalu","Szabolcs-Szatmár-Bereg"]
[null,null,null,null,null,null,null,null,null,null,null,null,null,null,null,null,null,null,null,null,3385,"Tiszanána","Heves"]
[null,null,null,null,null,null,null,null,null,null,null,null,null,null,null,null,null,null,null,null,5362,"Tiszaörs","Jász-Nagykun-Szolnok"]
[null,null,null,null,null,null,null,null,null,null,null,null,null,null,null,null,null,null,null,null,3587,"Tiszapalkonya","Borsod-Abaúj-Zemplén"]
[null,null,null,null,null,null,null,null,null,null,null,null,null,null,null,null,null,null,null,null,5211,"Tiszapüspöki","Jász-Nagykun-Szolnok"]
[null,null,null,null,null,null,null,null,null,null,null,null,null,null,null,null,null,null,null,null,4503,"Tiszarád","Szabolcs-Szatmár-Bereg"]
[null,null,null,null,null,null,null,null,null,null,null,null,null,null,null,null,null,null,null,null,5234,"Tiszaroff","Jász-Nagykun-Szolnok"]
[null,null,null,null,null,null,null,null,null,null,null,null,null,null,null,null,null,null,null,null,5474,"Tiszasas","Jász-Nagykun-Szolnok"]
[null,null,null,null,null,null,null,null,null,null,null,null,null,null,null,null,null,null,null,null,5061,"Tiszasüly","Jász-Nagykun-Szolnok"]
[null,null,null,null,null,null,null,null,null,null,null,null,null,null,null,null,null,null,null,null,4831,"Tiszaszalka","Szabolcs-Szatmár-Bereg"]
[null,null,null,null,null,null,null,null,null,null,null,null,null,null,null,null,null,null,null,null,5323,"Tiszaszentimre","Jász-Nagykun-Szolnok"]
[null,null,null,null,null,null,null,null,null,null,null,null,null,null,null,null,null,null,null,null,5322,"Tiszaszentimre","Jász-Nagykun-Szolnok"]
[null,null,null,null,null,null,null,null,null,null,null,null,null,null,null,null,null,null,null,null,4628,"Tiszaszentmárton","Szabolcs-Szatmár-Bereg"]
[null,null,null,null,null,null,null,null,null,null,null,null,null,null,null,null,null,null,null,null,6756,"Tiszasziget","Csongrád"]
[null,null,null,null,null,null,null,null,null,null,null,null,null,null,null,null,null,null,null,null,3928,"Tiszatardos","Borsod-Abaúj-Zemplén"]
[null,null,null,null,null,null,null,null,null,null,null,null,null,null,null,null,null,null,null,null,3589,"Tiszatarján","Borsod-Abaúj-Zemplén"]
[null,null,null,null,null,null,null,null,null,null,null,null,null,null,null,null,null,null,null,null,4486,"Tiszatelek","Szabolcs-Szatmár-Bereg"]
[null,null,null,null,null,null,null,null,null,null,null,null,null,null,null,null,null,null,null,null,4487,"Tiszatelek","Szabolcs-Szatmár-Bereg"]
[null,null,null,null,null,null,null,null,null,null,null,null,null,null,null,null,null,null,null,null,5082,"Tiszatenyő","Jász-Nagykun-Szolnok"]
[null,null,null,null,null,null,null,null,null,null,null,null,null,null,null,null,null,null,null,null,6064,"Tiszaug","Bács-Kiskun"]
[null,null,null,null,null,null,null,null,null,null,null,null,null,null,null,null,null,null,null,null,3580,"Tiszaújváros","Borsod-Abaúj-Zemplén"]
[null,null,null,null,null,null,null,null,null,null,null,null,null,null,null,null,null,null,null,null,3464,"Tiszavalk","Borsod-Abaúj-Zemplén"]
[null,null,null,null,null,null,null,null,null,null,null,null,null,null,null,null,null,null,null,null,5095,"Tiszavárkony","Jász-Nagykun-Szolnok"]
[null,null,null,null,null,null,null,null,null,null,null,null,null,null,null,null,null,null,null,null,5092,"Tiszavárkony","Jász-Nagykun-Szolnok"]
[null,null,null,null,null,null,null,null,null,null,null,null,null,null,null,null,null,null,null,null,4440,"Tiszavasvári","Szabolcs-Szatmár-Bereg"]
[null,null,null,null,null,null,null,null,null,null,null,null,null,null,null,null,null,null,null,null,4832,"Tiszavid","Szabolcs-Szatmár-Bereg"]
[null,null,null,null,null,null,null,null,null,null,null,null,null,null,null,null,null,null,null,null,4969,"Tisztaberek","Szabolcs-Szatmár-Bereg"]
[null,null,null,null,null,null,null,null,null,null,null,null,null,null,null,null,null,null,null,null,4921,"Tivadar","Szabolcs-Szatmár-Bereg"]
[null,null,null,null,null,null,null,null,null,null,null,null,null,null,null,null,null,null,null,null,2252,"Tóalmás","Pest"]
[null,null,null,null,null,null,null,null,null,null,null,null,null,null,null,null,null,null,null,null,3354,"Tófalu","Heves"]
[null,null,null,null,null,null,null,null,null,null,null,null,null,null,null,null,null,null,null,null,8946,"Tófej","Zala"]
[null,null,null,null,null,null,null,null,null,null,null,null,null,null,null,null,null,null,null,null,7348,"Tófű","Baranya"]
[null,null,null,null,null,null,null,null,null,null,null,null,null,null,null,null,null,null,null,null,2073,"Tök","Borsod-Abaúj-Zemplén"]
[null,null,null,null,null,null,null,null,null,null,null,null,null,null,null,null,null,null,null,null,3910,"Tokaj","Komárom-Esztergom"]
[null,null,null,null,null,null,null,null,null,null,null,null,null,null,null,null,null,null,null,null,2531,"Tokod","Komárom-Esztergom"]
[null,null,null,null,null,null,null,null,null,null,null,null,null,null,null,null,null,null,null,null,2532,"Tokodaltáró","Vas"]
[null,null,null,null,null,null,null,null,null,null,null,null,null,null,null,null,null,null,null,null,2316,"Tököl","Borsod-Abaúj-Zemplén"]
[null,null,null,null,null,null,null,null,null,null,null,null,null,null,null,null,null,null,null,null,9561,"Tokorcs","Hajdú-Bihar"]
[null,null,null,null,null,null,null,null,null,null,null,null,null,null,null,null,null,null,null,null,3934,"Tolcsva","Nógrád"]
[null,null,null,null,null,null,null,null,null,null,null,null,null,null,null,null,null,null,null,null,4117,"Told","Tolna"]
[null,null,null,null,null,null,null,null,null,null,null,null,null,null,null,null,null,null,null,null,2657,"Tolmács","Tolna"]
[null,null,null,null,null,null,null,null,null,null,null,null,null,null,null,null,null,null,null,null,7131,"Tolna","Tolna"]
[null,null,null,null,null,null,null,null,null,null,null,null,null,null,null,null,null,null,null,null,7130,"Tolna","Jász-Nagykun-Szolnok"]
[null,null,null,null,null,null,null,null,null,null,null,null,null,null,null,null,null,null,null,null,7083,"Tolnanémedi","Borsod-Abaúj-Zemplén"]
[null,null,null,null,null,null,null,null,null,null,null,null,null,null,null,null,null,null,null,null,9086,"Töltéstava","Bács-Kiskun"]
[null,null,null,null,null,null,null,null,null,null,null,null,null,null,null,null,null,null,null,null,5324,"Tomajmonostora","Vas"]
[null,null,null,null,null,null,null,null,null,null,null,null,null,null,null,null,null,null,null,null,3787,"Tomor","Fejér"]
[null,null,null,null,null,null,null,null,null,null,null,null,null,null,null,null,null,null,null,null,9738,"Tömörd","Zala"]
[null,null,null,null,null,null,null,null,null,null,null,null,null,null,null,null,null,null,null,null,6646,"Tömörkény","Baranya"]
[null,null,null,null,null,null,null,null,null,null,null,null,null,null,null,null,null,null,null,null,6422,"Tompa","Vas"]
[null,null,null,null,null,null,null,null,null,null,null,null,null,null,null,null,null,null,null,null,9662,"Tompaládony","Borsod-Abaúj-Zemplén"]
[null,null,null,null,null,null,null,null,null,null,null,null,null,null,null,null,null,null,null,null,2463,"Tordas","Borsod-Abaúj-Zemplén"]
[null,null,null,null,null,null,null,null,null,null,null,null,null,null,null,null,null,null,null,null,8876,"Tormafölde","Borsod-Abaúj-Zemplén"]
[null,null,null,null,null,null,null,null,null,null,null,null,null,null,null,null,null,null,null,null,7383,"Tormás","Borsod-Abaúj-Zemplén"]
[null,null,null,null,null,null,null,null,null,null,null,null,null,null,null,null,null,null,null,null,9736,"Tormásliget","Borsod-Abaúj-Zemplén"]
[null,null,null,null,null,null,null,null,null,null,null,null,null,null,null,null,null,null,null,null,3765,"Tornabarakony","Zala"]
[null,null,null,null,null,null,null,null,null,null,null,null,null,null,null,null,null,null,null,null,3761,"Tornakápolna","Borsod-Abaúj-Zemplén"]
[null,null,null,null,null,null,null,null,null,null,null,null,null,null,null,null,null,null,null,null,3767,"Tornanádaska","Szabolcs-Szatmár-Bereg"]
[null,null,null,null,null,null,null,null,null,null,null,null,null,null,null,null,null,null,null,null,3765,"Tornaszentandrás","Vas"]
[null,null,null,null,null,null,null,null,null,null,null,null,null,null,null,null,null,null,null,null,3769,"Tornaszentjakab","Somogy"]
[null,null,null,null,null,null,null,null,null,null,null,null,null,null,null,null,null,null,null,null,8877,"Tornyiszentmiklós","Jász-Nagykun-Szolnok"]
[null,null,null,null,null,null,null,null,null,null,null,null,null,null,null,null,null,null,null,null,3877,"Tornyosnémeti","Békés"]
[null,null,null,null,null,null,null,null,null,null,null,null,null,null,null,null,null,null,null,null,4642,"Tornyospálca","Baranya"]
[null,null,null,null,null,null,null,null,null,null,null,null,null,null,null,null,null,null,null,null,2045,"Törökbálint","Zala"]
[null,null,null,null,null,null,null,null,null,null,null,null,null,null,null,null,null,null,null,null,7285,"Törökkoppány","Zala"]
[null,null,null,null,null,null,null,null,null,null,null,null,null,null,null,null,null,null,null,null,5212,"Törökszentmiklós","Somogy"]
[null,null,null,null,null,null,null,null,null,null,null,null,null,null,null,null,null,null,null,null,5200,"Törökszentmiklós","Veszprém"]
[null,null,null,null,null,null,null,null,null,null,null,null,null,null,null,null,null,null,null,null,9791,"Torony","Pest"]
[null,null,null,null,null,null,null,null,null,null,null,null,null,null,null,null,null,null,null,null,2747,"Törtel","Pest"]
[null,null,null,null,null,null,null,null,null,null,null,null,null,null,null,null,null,null,null,null,8660,"Torvaj","Győr-Moson-Sopron"]
[null,null,null,null,null,null,null,null,null,null,null,null,null,null,null,null,null,null,null,null,5091,"Tószeg","Vas"]
[null,null,null,null,null,null,null,null,null,null,null,null,null,null,null,null,null,null,null,null,5940,"Tótkomlós","Csongrád"]
[null,null,null,null,null,null,null,null,null,null,null,null,null,null,null,null,null,null,null,null,7981,"Tótszentgyörgy","Pest"]
[null,null,null,null,null,null,null,null,null,null,null,null,null,null,null,null,null,null,null,null,8865,"Tótszentmárton","Somogy"]
[null,null,null,null,null,null,null,null,null,null,null,null,null,null,null,null,null,null,null,null,8864,"Tótszerdahely","Jász-Nagykun-Szolnok"]
[null,null,null,null,null,null,null,null,null,null,null,null,null,null,null,null,null,null,null,null,7755,"Töttös","Jász-Nagykun-Szolnok"]
[null,null,null,null,null,null,null,null,null,null,null,null,null,null,null,null,null,null,null,null,7918,"Tótújfalu","Pest"]
[null,null,null,null,null,null,null,null,null,null,null,null,null,null,null,null,null,null,null,null,8246,"Tótvázsony","Baranya"]
[null,null,null,null,null,null,null,null,null,null,null,null,null,null,null,null,null,null,null,null,3724,"Trizs","Borsod-Abaúj-Zemplén"]
[null,null,null,null,null,null,null,null,null,null,null,null,null,null,null,null,null,null,null,null,4731,"Tunyogmatolcs","Szabolcs-Szatmár-Bereg"]
[null,null,null,null,null,null,null,null,null,null,null,null,null,null,null,null,null,null,null,null,2194,"Tura","Pest"]
[null,null,null,null,null,null,null,null,null,null,null,null,null,null,null,null,null,null,null,null,4944,"Túristvándi","Szabolcs-Szatmár-Bereg"]
[null,null,null,null,null,null,null,null,null,null,null,null,null,null,null,null,null,null,null,null,8796,"Türje","Jász-Nagykun-Szolnok"]
[null,null,null,null,null,null,null,null,null,null,null,null,null,null,null,null,null,null,null,null,5420,"Túrkeve","Baranya"]
[null,null,null,null,null,null,null,null,null,null,null,null,null,null,null,null,null,null,null,null,7811,"Túrony","Szabolcs-Szatmár-Bereg"]
[null,null,null,null,null,null,null,null,null,null,null,null,null,null,null,null,null,null,null,null,4968,"Túrricse","Szabolcs-Szatmár-Bereg"]
[null,null,null,null,null,null,null,null,null,null,null,null,null,null,null,null,null,null,null,null,8477,"Tüskevár","Zala"]
[null,null,null,null,null,null,null,null,null,null,null,null,null,null,null,null,null,null,null,null,4623,"Tuzsér","Veszprém"]
[null,null,null,null,null,null,null,null,null,null,null,null,null,null,null,null,null,null,null,null,4762,"Tyukod","Szabolcs-Szatmár-Bereg"]
[null,null,null,null,null,null,null,null,null,null,null,null,null,null,null,null,null,null,null,null,7718,"Udvar","Baranya"]
[null,null,null,null,null,null,null,null,null,null,null,null,null,null,null,null,null,null,null,null,7066,"Udvari","Tolna"]
[null,null,null,null,null,null,null,null,null,null,null,null,null,null,null,null,null,null,null,null,8564,"Ugod","Veszprém"]
[null,null,null,null,null,null,null,null,null,null,null,null,null,null,null,null,null,null,null,null,2066,"Újbarok","Fejér"]
[null,null,null,null,null,null,null,null,null,null,null,null,null,null,null,null,null,null,null,null,3716,"Újcsanálos","Borsod-Abaúj-Zemplén"]
[null,null,null,null,null,null,null,null,null,null,null,null,null,null,null,null,null,null,null,null,4491,"Újdombrád","Szabolcs-Szatmár-Bereg"]
[null,null,null,null,null,null,null,null,null,null,null,null,null,null,null,null,null,null,null,null,4244,"Újfehértó","Szabolcs-Szatmár-Bereg"]
[null,null,null,null,null,null,null,null,null,null,null,null,null,null,null,null,null,null,null,null,2367,"Újhartyán","Pest"]
[null,null,null,null,null,null,null,null,null,null,null,null,null,null,null,null,null,null,null,null,4146,"Újiráz","Hajdú-Bihar"]
[null,null,null,null,null,null,null,null,null,null,null,null,null,null,null,null,null,null,null,null,7095,"Újireg","Tolna"]
[null,null,null,null,null,null,null,null,null,null,null,null,null,null,null,null,null,null,null,null,4635,"Újkenéz","Szabolcs-Szatmár-Bereg"]
[null,null,null,null,null,null,null,null,null,null,null,null,null,null,null,null,null,null,null,null,9472,"Újkér","Győr-Moson-Sopron"]
[null,null,null,null,null,null,null,null,null,null,null,null,null,null,null,null,null,null,null,null,5661,"Újkígyós","Békés"]
[null,null,null,null,null,null,null,null,null,null,null,null,null,null,null,null,null,null,null,null,2724,"Újlengyel","Pest"]
[null,null,null,null,null,null,null,null,null,null,null,null,null,null,null,null,null,null,null,null,4288,"Újléta","Hajdú-Bihar"]
[null,null,null,null,null,null,null,null,null,null,null,null,null,null,null,null,null,null,null,null,3387,"Újlőrincfalva","Heves"]
[null,null,null,null,null,null,null,null,null,null,null,null,null,null,null,null,null,null,null,null,7766,"Újpetre","Baranya"]
[null,null,null,null,null,null,null,null,null,null,null,null,null,null,null,null,null,null,null,null,9244,"Újrónafő","Győr-Moson-Sopron"]
[null,null,null,null,null,null,null,null,null,null,null,null,null,null,null,null,null,null,null,null,6320,"Újsolt","Bács-Kiskun"]
[null,null,null,null,null,null,null,null,null,null,null,null,null,null,null,null,null,null,null,null,5727,"Újszalonta","Békés"]
[null,null,null,null,null,null,null,null,null,null,null,null,null,null,null,null,null,null,null,null,5052,"Újszász","Jász-Nagykun-Szolnok"]
[null,null,null,null,null,null,null,null,null,null,null,null,null,null,null,null,null,null,null,null,6754,"Újszentiván","Csongrád"]
[null,null,null,null,null,null,null,null,null,null,null,null,null,null,null,null,null,null,null,null,4065,"Újszentmargita","Hajdú-Bihar"]
[null,null,null,null,null,null,null,null,null,null,null,null,null,null,null,null,null,null,null,null,2768,"Újszilvás","Pest"]
[null,null,null,null,null,null,null,null,null,null,null,null,null,null,null,null,null,null,null,null,6337,"Újtelek","Bács-Kiskun"]
[null,null,null,null,null,null,null,null,null,null,null,null,null,null,null,null,null,null,null,null,4096,"Újtikos","Hajdú-Bihar"]
[null,null,null,null,null,null,null,null,null,null,null,null,null,null,null,null,null,null,null,null,8778,"Újudvar","Zala"]
[null,null,null,null,null,null,null,null,null,null,null,null,null,null,null,null,null,null,null,null,7436,"Újvárfalva","Somogy"]
[null,null,null,null,null,null,null,null,null,null,null,null,null,null,null,null,null,null,null,null,8347,"Ukk","Veszprém"]
[null,null,null,null,null,null,null,null,null,null,null,null,null,null,null,null,null,null,null,null,6794,"Üllés","Győr-Moson-Sopron"]
[null,null,null,null,null,null,null,null,null,null,null,null,null,null,null,null,null,null,null,null,2225,"Üllő","Komárom-Esztergom"]
[null,null,null,null,null,null,null,null,null,null,null,null,null,null,null,null,null,null,null,null,9464,"Und","Borsod-Abaúj-Zemplén"]
[null,null,null,null,null,null,null,null,null,null,null,null,null,null,null,null,null,null,null,null,2528,"Úny","Szabolcs-Szatmár-Bereg"]
[null,null,null,null,null,null,null,null,null,null,null,null,null,null,null,null,null,null,null,null,3622,"Uppony","Vas"]
[null,null,null,null,null,null,null,null,null,null,null,null,null,null,null,null,null,null,null,null,4763,"Ura","Fejér"]
[null,null,null,null,null,null,null,null,null,null,null,null,null,null,null,null,null,null,null,null,9651,"Uraiújfalu","Pest"]
[null,null,null,null,null,null,null,null,null,null,null,null,null,null,null,null,null,null,null,null,8142,"Úrhida","Veszprém"]
[null,null,null,null,null,null,null,null,null,null,null,null,null,null,null,null,null,null,null,null,2244,"Úri","Szabolcs-Szatmár-Bereg"]
[null,null,null,null,null,null,null,null,null,null,null,null,null,null,null,null,null,null,null,null,8409,"Úrkút","Bács-Kiskun"]
[null,null,null,null,null,null,null,null,null,null,null,null,null,null,null,null,null,null,null,null,2096,"Üröm","Veszprém"]
[null,null,null,null,null,null,null,null,null,null,null,null,null,null,null,null,null,null,null,null,4952,"Uszka","Csongrád"]
[null,null,null,null,null,null,null,null,null,null,null,null,null,null,null,null,null,null,null,null,6332,"Uszód","Pest"]
[null,null,null,null,null,null,null,null,null,null,null,null,null,null,null,null,null,null,null,null,8321,"Uzsa","Pest"]
[null,null,null,null,null,null,null,null,null,null,null,null,null,null,null,null,null,null,null,null,2600,"Vác","Pest"]
[null,null,null,null,null,null,null,null,null,null,null,null,null,null,null,null,null,null,null,null,2167,"Vácduka","Pest"]
[null,null,null,null,null,null,null,null,null,null,null,null,null,null,null,null,null,null,null,null,2184,"Vácegres","Pest"]
[null,null,null,null,null,null,null,null,null,null,null,null,null,null,null,null,null,null,null,null,2164,"Váchartyán","Pest"]
[null,null,null,null,null,null,null,null,null,null,null,null,null,null,null,null,null,null,null,null,2185,"Váckisújfalu","Pest"]
[null,null,null,null,null,null,null,null,null,null,null,null,null,null,null,null,null,null,null,null,2163,"Vácrátót","Pest"]
[null,null,null,null,null,null,null,null,null,null,null,null,null,null,null,null,null,null,null,null,2115,"Vácszentlászló","Pest"]
[null,null,null,null,null,null,null,null,null,null,null,null,null,null,null,null,null,null,null,null,3636,"Vadna","Borsod-Abaúj-Zemplén"]
[null,null,null,null,null,null,null,null,null,null,null,null,null,null,null,null,null,null,null,null,9346,"Vadosfa","Győr-Moson-Sopron"]
[null,null,null,null,null,null,null,null,null,null,null,null,null,null,null,null,null,null,null,null,9327,"Vág","Győr-Moson-Sopron"]
[null,null,null,null,null,null,null,null,null,null,null,null,null,null,null,null,null,null,null,null,3992,"Vágáshuta","Borsod-Abaúj-Zemplén"]
[null,null,null,null,null,null,null,null,null,null,null,null,null,null,null,null,null,null,null,null,4562,"Vaja","Szabolcs-Szatmár-Bereg"]
[null,null,null,null,null,null,null,null,null,null,null,null,null,null,null,null,null,null,null,null,3961,"Vajdácska","Borsod-Abaúj-Zemplén"]
[null,null,null,null,null,null,null,null,null,null,null,null,null,null,null,null,null,null,null,null,7838,"Vajszló","Baranya"]
[null,null,null,null,null,null,null,null,null,null,null,null,null,null,null,null,null,null,null,null,7041,"Vajta","Fejér"]
[null,null,null,null,null,null,null,null,null,null,null,null,null,null,null,null,null,null,null,null,2473,"Vál","Fejér"]
[null,null,null,null,null,null,null,null,null,null,null,null,null,null,null,null,null,null,null,null,2114,"Valkó","Pest"]
[null,null,null,null,null,null,null,null,null,null,null,null,null,null,null,null,null,null,null,null,8885,"Valkonya","Zala"]
[null,null,null,null,null,null,null,null,null,null,null,null,null,null,null,null,null,null,null,null,4351,"Vállaj","Szabolcs-Szatmár-Bereg"]
[null,null,null,null,null,null,null,null,null,null,null,null,null,null,null,null,null,null,null,null,8316,"Vállus","Zala"]
[null,null,null,null,null,null,null,null,null,null,null,null,null,null,null,null,null,null,null,null,4936,"Vámosatya","Szabolcs-Szatmár-Bereg"]
[null,null,null,null,null,null,null,null,null,null,null,null,null,null,null,null,null,null,null,null,9665,"Vámoscsalád","Vas"]
[null,null,null,null,null,null,null,null,null,null,null,null,null,null,null,null,null,null,null,null,3291,"Vámosgyörk","Heves"]
[null,null,null,null,null,null,null,null,null,null,null,null,null,null,null,null,null,null,null,null,2635,"Vámosmikola","Pest"]
[null,null,null,null,null,null,null,null,null,null,null,null,null,null,null,null,null,null,null,null,4966,"Vámosoroszi","Szabolcs-Szatmár-Bereg"]
[null,null,null,null,null,null,null,null,null,null,null,null,null,null,null,null,null,null,null,null,4287,"Vámospércs","Hajdú-Bihar"]
[null,null,null,null,null,null,null,null,null,null,null,null,null,null,null,null,null,null,null,null,9061,"Vámosszabadi","Borsod-Abaúj-Zemplén"]
[null,null,null,null,null,null,null,null,null,null,null,null,null,null,null,null,null,null,null,null,3941,"Vámosújfalu","Győr-Moson-Sopron"]
[null,null,null,null,null,null,null,null,null,null,null,null,null,null,null,null,null,null,null,null,4119,"Váncsod","Hajdú-Bihar"]
[null,null,null,null,null,null,null,null,null,null,null,null,null,null,null,null,null,null,null,null,2688,"Vanyarc","Nógrád"]
[null,null,null,null,null,null,null,null,null,null,null,null,null,null,null,null,null,null,null,null,8552,"Vanyola","Veszprém"]
[null,null,null,null,null,null,null,null,null,null,null,null,null,null,null,null,null,null,null,null,7973,"Várad","Baranya"]
[null,null,null,null,null,null,null,null,null,null,null,null,null,null,null,null,null,null,null,null,7354,"Váralja","Tolna"]
[null,null,null,null,null,null,null,null,null,null,null,null,null,null,null,null,null,null,null,null,8723,"Varászló","Somogy"]
[null,null,null,null,null,null,null,null,null,null,null,null,null,null,null,null,null,null,null,null,3254,"Váraszó","Heves"]
[null,null,null,null,null,null,null,null,null,null,null,null,null,null,null,null,null,null,null,null,9243,"Várbalog","Győr-Moson-Sopron"]
[null,null,null,null,null,null,null,null,null,null,null,null,null,null,null,null,null,null,null,null,3778,"Varbó","Borsod-Abaúj-Zemplén"]
[null,null,null,null,null,null,null,null,null,null,null,null,null,null,null,null,null,null,null,null,3756,"Varbóc","Borsod-Abaúj-Zemplén"]
[null,null,null,null,null,null,null,null,null,null,null,null,null,null,null,null,null,null,null,null,7442,"Várda","Somogy"]
[null,null,null,null,null,null,null,null,null,null,null,null,null,null,null,null,null,null,null,null,7146,"Várdomb","Tolna"]
[null,null,null,null,null,null,null,null,null,null,null,null,null,null,null,null,null,null,null,null,8891,"Várfölde","Zala"]
[null,null,null,null,null,null,null,null,null,null,null,null,null,null,null,null,null,null,null,null,7370,"Varga","Baranya"]
[null,null,null,null,null,null,null,null,null,null,null,null,null,null,null,null,null,null,null,null,2824,"Várgesztes","Komárom-Esztergom"]
[null,null,null,null,null,null,null,null,null,null,null,null,null,null,null,null,null,null,null,null,8523,"Várkesző","Veszprém"]
[null,null,null,null,null,null,null,null,null,null,null,null,null,null,null,null,null,null,null,null,7214,"Várong","Tolna"]
[null,null,null,null,null,null,null,null,null,null,null,null,null,null,null,null,null,null,null,null,6033,"Városföld","Bács-Kiskun"]
[null,null,null,null,null,null,null,null,null,null,null,null,null,null,null,null,null,null,null,null,8445,"Városlőd","Veszprém"]
[null,null,null,null,null,null,null,null,null,null,null,null,null,null,null,null,null,null,null,null,8103,"Várpalota","Veszprém"]
[null,null,null,null,null,null,null,null,null,null,null,null,null,null,null,null,null,null,null,null,8104,"Várpalota","Veszprém"]
[null,null,null,null,null,null,null,null,null,null,null,null,null,null,null,null,null,null,null,null,8100,"Várpalota","Veszprém"]
[null,null,null,null,null,null,null,null,null,null,null,null,null,null,null,null,null,null,null,null,7067,"Varsád","Tolna"]
[null,null,null,null,null,null,null,null,null,null,null,null,null,null,null,null,null,null,null,null,3178,"Varsány","Nógrád"]
[null,null,null,null,null,null,null,null,null,null,null,null,null,null,null,null,null,null,null,null,8316,"Várvölgy","Zala"]
[null,null,null,null,null,null,null,null,null,null,null,null,null,null,null,null,null,null,null,null,2211,"Vasad","Pest"]
[null,null,null,null,null,null,null,null,null,null,null,null,null,null,null,null,null,null,null,null,9921,"Vasalja","Vas"]
[null,null,null,null,null,null,null,null,null,null,null,null,null,null,null,null,null,null,null,null,7926,"Vásárosbéc","Baranya"]
[null,null,null,null,null,null,null,null,null,null,null,null,null,null,null,null,null,null,null,null,7362,"Vásárosdombó","Baranya"]
[null,null,null,null,null,null,null,null,null,null,null,null,null,null,null,null,null,null,null,null,9343,"Vásárosfalu","Győr-Moson-Sopron"]
[null,null,null,null,null,null,null,null,null,null,null,null,null,null,null,null,null,null,null,null,9552,"Vásárosmiske","Vas"]
[null,null,null,null,null,null,null,null,null,null,null,null,null,null,null,null,null,null,null,null,4803,"Vásárosnamény","Szabolcs-Szatmár-Bereg"]
[null,null,null,null,null,null,null,null,null,null,null,null,null,null,null,null,null,null,null,null,4804,"Vásárosnamény","Szabolcs-Szatmár-Bereg"]
[null,null,null,null,null,null,null,null,null,null,null,null,null,null,null,null,null,null,null,null,4800,"Vásárosnamény","Szabolcs-Szatmár-Bereg"]
[null,null,null,null,null,null,null,null,null,null,null,null,null,null,null,null,null,null,null,null,9744,"Vasasszonyfa","Vas"]
[null,null,null,null,null,null,null,null,null,null,null,null,null,null,null,null,null,null,null,null,8914,"Vasboldogasszony","Zala"]
[null,null,null,null,null,null,null,null,null,null,null,null,null,null,null,null,null,null,null,null,9661,"Vasegerszeg","Vas"]
[null,null,null,null,null,null,null,null,null,null,null,null,null,null,null,null,null,null,null,null,9674,"Vashosszúfalu","Vas"]
[null,null,null,null,null,null,null,null,null,null,null,null,null,null,null,null,null,null,null,null,9795,"Vaskeresztes","Vas"]
[null,null,null,null,null,null,null,null,null,null,null,null,null,null,null,null,null,null,null,null,6521,"Vaskút","Bács-Kiskun"]
[null,null,null,null,null,null,null,null,null,null,null,null,null,null,null,null,null,null,null,null,4502,"Vasmegyer","Szabolcs-Szatmár-Bereg"]
[null,null,null,null,null,null,null,null,null,null,null,null,null,null,null,null,null,null,null,null,8998,"Vaspör","Zala"]
[null,null,null,null,null,null,null,null,null,null,null,null,null,null,null,null,null,null,null,null,9741,"Vassurány","Vas"]
[null,null,null,null,null,null,null,null,null,null,null,null,null,null,null,null,null,null,null,null,8245,"Vászoly","Veszprém"]
[null,null,null,null,null,null,null,null,null,null,null,null,null,null,null,null,null,null,null,null,9763,"Vasszécseny","Vas"]
[null,null,null,null,null,null,null,null,null,null,null,null,null,null,null,null,null,null,null,null,9953,"Vasszentmihály","Vas"]
[null,null,null,null,null,null,null,null,null,null,null,null,null,null,null,null,null,null,null,null,9747,"Vasszilvágy","Vas"]
[null,null,null,null,null,null,null,null,null,null,null,null,null,null,null,null,null,null,null,null,9800,"Vasvár","Vas"]
[null,null,null,null,null,null,null,null,null,null,null,null,null,null,null,null,null,null,null,null,8542,"Vaszar","Veszprém"]
[null,null,null,null,null,null,null,null,null,null,null,null,null,null,null,null,null,null,null,null,9748,"Vát","Vas"]
[null,null,null,null,null,null,null,null,null,null,null,null,null,null,null,null,null,null,null,null,3431,"Vatta","Borsod-Abaúj-Zemplén"]
[null,null,null,null,null,null,null,null,null,null,null,null,null,null,null,null,null,null,null,null,7370,"Vázsnok","Baranya"]
[null,null,null,null,null,null,null,null,null,null,null,null,null,null,null,null,null,null,null,null,3265,"Vécs","Heves"]
[null,null,null,null,null,null,null,null,null,null,null,null,null,null,null,null,null,null,null,null,2220,"Vecsés","Pest"]
[null,null,null,null,null,null,null,null,null,null,null,null,null,null,null,null,null,null,null,null,5811,"Végegyháza","Békés"]
[null,null,null,null,null,null,null,null,null,null,null,null,null,null,null,null,null,null,null,null,7838,"Vejti","Baranya"]
[null,null,null,null,null,null,null,null,null,null,null,null,null,null,null,null,null,null,null,null,7333,"Vékény","Baranya"]
[null,null,null,null,null,null,null,null,null,null,null,null,null,null,null,null,null,null,null,null,4143,"Vekerd","Hajdú-Bihar"]
[null,null,null,null,null,null,null,null,null,null,null,null,null,null,null,null,null,null,null,null,9726,"Velem","Vas"]
[null,null,null,null,null,null,null,null,null,null,null,null,null,null,null,null,null,null,null,null,9946,"Velemér","Vas"]
[null,null,null,null,null,null,null,null,null,null,null,null,null,null,null,null,null,null,null,null,2481,"Velence","Fejér"]
[null,null,null,null,null,null,null,null,null,null,null,null,null,null,null,null,null,null,null,null,7951,"Velény","Baranya"]
[null,null,null,null,null,null,null,null,null,null,null,null,null,null,null,null,null,null,null,null,7726,"Véménd","Baranya"]
[null,null,null,null,null,null,null,null,null,null,null,null,null,null,null,null,null,null,null,null,9062,"Vének","Győr-Moson-Sopron"]
[null,null,null,null,null,null,null,null,null,null,null,null,null,null,null,null,null,null,null,null,9751,"Vép","Vas"]
[null,null,null,null,null,null,null,null,null,null,null,null,null,null,null,null,null,null,null,null,2477,"Vereb","Fejér"]
[null,null,null,null,null,null,null,null,null,null,null,null,null,null,null,null,null,null,null,null,2112,"Veresegyház","Pest"]
[null,null,null,null,null,null,null,null,null,null,null,null,null,null,null,null,null,null,null,null,2621,"Verőce","Pest"]
[null,null,null,null,null,null,null,null,null,null,null,null,null,null,null,null,null,null,null,null,3351,"Verpelét","Heves"]
[null,null,null,null,null,null,null,null,null,null,null,null,null,null,null,null,null,null,null,null,2174,"Verseg","Pest"]
[null,null,null,null,null,null,null,null,null,null,null,null,null,null,null,null,null,null,null,null,7752,"Versend","Baranya"]
[null,null,null,null,null,null,null,null,null,null,null,null,null,null,null,null,null,null,null,null,8089,"Vértesacsa","Fejér"]
[null,null,null,null,null,null,null,null,null,null,null,null,null,null,null,null,null,null,null,null,8085,"Vértesboglár","Fejér"]
[null,null,null,null,null,null,null,null,null,null,null,null,null,null,null,null,null,null,null,null,2859,"Vérteskethely","Komárom-Esztergom"]
[null,null,null,null,null,null,null,null,null,null,null,null,null,null,null,null,null,null,null,null,2823,"Vértessomló","Komárom-Esztergom"]
[null,null,null,null,null,null,null,null,null,null,null,null,null,null,null,null,null,null,null,null,2833,"Vértestolna","Komárom-Esztergom"]
[null,null,null,null,null,null,null,null,null,null,null,null,null,null,null,null,null,null,null,null,2837,"Vértesszőlős","Komárom-Esztergom"]
[null,null,null,null,null,null,null,null,null,null,null,null,null,null,null,null,null,null,null,null,8721,"Vése","Somogy"]
[null,null,null,null,null,null,null,null,null,null,null,null,null,null,null,null,null,null,null,null,9352,"Veszkény","Győr-Moson-Sopron"]
[null,null,null,null,null,null,null,null,null,null,null,null,null,null,null,null,null,null,null,null,8412,"Veszprém","Veszprém"]
[null,null,null,null,null,null,null,null,null,null,null,null,null,null,null,null,null,null,null,null,8411,"Veszprém","Veszprém"]
[null,null,null,null,null,null,null,null,null,null,null,null,null,null,null,null,null,null,null,null,8200,"Veszprém","Veszprém"]
[null,null,null,null,null,null,null,null,null,null,null,null,null,null,null,null,null,null,null,null,8248,"Veszprémfajsz","Veszprém"]
[null,null,null,null,null,null,null,null,null,null,null,null,null,null,null,null,null,null,null,null,8475,"Veszprémgalsa","Veszprém"]
[null,null,null,null,null,null,null,null,null,null,null,null,null,null,null,null,null,null,null,null,8438,"Veszprémvarsány","Veszprém"]
[null,null,null,null,null,null,null,null,null,null,null,null,null,null,null,null,null,null,null,null,5530,"Vésztő","Békés"]
[null,null,null,null,null,null,null,null,null,null,null,null,null,null,null,null,null,null,null,null,5093,"Vezseny","Jász-Nagykun-Szolnok"]
[null,null,null,null,null,null,null,null,null,null,null,null,null,null,null,null,null,null,null,null,8484,"Vid","Veszprém"]
[null,null,null,null,null,null,null,null,null,null,null,null,null,null,null,null,null,null,null,null,8294,"Vigántpetend","Veszprém"]
[null,null,null,null,null,null,null,null,null,null,null,null,null,null,null,null,null,null,null,null,7773,"Villány","Baranya"]
[null,null,null,null,null,null,null,null,null,null,null,null,null,null,null,null,null,null,null,null,7772,"Villánykövesd","Baranya"]
[null,null,null,null,null,null,null,null,null,null,null,null,null,null,null,null,null,null,null,null,3891,"Vilmány","Borsod-Abaúj-Zemplén"]
[null,null,null,null,null,null,null,null,null,null,null,null,null,null,null,null,null,null,null,null,8194,"Vilonya","Veszprém"]
[null,null,null,null,null,null,null,null,null,null,null,null,null,null,null,null,null,null,null,null,3991,"Vilyvitány","Borsod-Abaúj-Zemplén"]
[null,null,null,null,null,null,null,null,null,null,null,null,null,null,null,null,null,null,null,null,9535,"Vinár","Veszprém"]
[null,null,null,null,null,null,null,null,null,null,null,null,null,null,null,null,null,null,null,null,8354,"Vindornyafok","Zala"]
[null,null,null,null,null,null,null,null,null,null,null,null,null,null,null,null,null,null,null,null,8353,"Vindornyalak","Zala"]
[null,null,null,null,null,null,null,null,null,null,null,null,null,null,null,null,null,null,null,null,8355,"Vindornyaszőlős","Zala"]
[null,null,null,null,null,null,null,null,null,null,null,null,null,null,null,null,null,null,null,null,2026,"Visegrád","Pest"]
[null,null,null,null,null,null,null,null,null,null,null,null,null,null,null,null,null,null,null,null,2025,"Visegrád","Pest"]
[null,null,null,null,null,null,null,null,null,null,null,null,null,null,null,null,null,null,null,null,7533,"Visnye","Somogy"]
[null,null,null,null,null,null,null,null,null,null,null,null,null,null,null,null,null,null,null,null,3272,"Visonta","Heves"]
[null,null,null,null,null,null,null,null,null,null,null,null,null,null,null,null,null,null,null,null,3271,"Visonta","Heves"]
[null,null,null,null,null,null,null,null,null,null,null,null,null,null,null,null,null,null,null,null,3956,"Viss","Borsod-Abaúj-Zemplén"]
[null,null,null,null,null,null,null,null,null,null,null,null,null,null,null,null,null,null,null,null,8681,"Visz","Somogy"]
[null,null,null,null,null,null,null,null,null,null,null,null,null,null,null,null,null,null,null,null,9932,"Viszák","Vas"]
[null,null,null,null,null,null,null,null,null,null,null,null,null,null,null,null,null,null,null,null,3825,"Viszló","Borsod-Abaúj-Zemplén"]
[null,null,null,null,null,null,null,null,null,null,null,null,null,null,null,null,null,null,null,null,3293,"Visznek","Heves"]
[null,null,null,null,null,null,null,null,null,null,null,null,null,null,null,null,null,null,null,null,9371,"Vitnyéd","Győr-Moson-Sopron"]
[null,null,null,null,null,null,null,null,null,null,null,null,null,null,null,null,null,null,null,null,7588,"Vízvár","Somogy"]
[null,null,null,null,null,null,null,null,null,null,null,null,null,null,null,null,null,null,null,null,3128,"Vizslás","Nógrád"]
[null,null,null,null,null,null,null,null,null,null,null,null,null,null,null,null,null,null,null,null,3888,"Vizsoly","Borsod-Abaúj-Zemplén"]
[null,null,null,null,null,null,null,null,null,null,null,null,null,null,null,null,null,null,null,null,7768,"Vokány","Baranya"]
[null,null,null,null,null,null,null,null,null,null,null,null,null,null,null,null,null,null,null,null,8314,"Vonyarcvashegy","Zala"]
[null,null,null,null,null,null,null,null,null,null,null,null,null,null,null,null,null,null,null,null,8931,"Vöckönd","Zala"]
[null,null,null,null,null,null,null,null,null,null,null,null,null,null,null,null,null,null,null,null,9462,"Völcsej","Győr-Moson-Sopron"]
[null,null,null,null,null,null,null,null,null,null,null,null,null,null,null,null,null,null,null,null,9516,"Vönöck","Vas"]
[null,null,null,null,null,null,null,null,null,null,null,null,null,null,null,null,null,null,null,null,8291,"Vöröstó","Veszprém"]
[null,null,null,null,null,null,null,null,null,null,null,null,null,null,null,null,null,null,null,null,8711,"Vörs","Somogy"]
[null,null,null,null,null,null,null,null,null,null,null,null,null,null,null,null,null,null,null,null,3124,"Zabar","Nógrád"]
[null,null,null,null,null,null,null,null,null,null,null,null,null,null,null,null,null,null,null,null,7976,"Zádor","Baranya"]
[null,null,null,null,null,null,null,null,null,null,null,null,null,null,null,null,null,null,null,null,3726,"Zádorfalva","Borsod-Abaúj-Zemplén"]
[null,null,null,null,null,null,null,null,null,null,null,null,null,null,null,null,null,null,null,null,5051,"Zagyvarékas","Jász-Nagykun-Szolnok"]
[null,null,null,null,null,null,null,null,null,null,null,null,null,null,null,null,null,null,null,null,3031,"Zagyvaszántó","Heves"]
[null,null,null,null,null,null,null,null,null,null,null,null,null,null,null,null,null,null,null,null,4625,"Záhony","Szabolcs-Szatmár-Bereg"]
[null,null,null,null,null,null,null,null,null,null,null,null,null,null,null,null,null,null,null,null,8868,"Zajk","Zala"]
[null,null,null,null,null,null,null,null,null,null,null,null,null,null,null,null,null,null,null,null,4974,"Zajta","Szabolcs-Szatmár-Bereg"]
[null,null,null,null,null,null,null,null,null,null,null,null,null,null,null,null,null,null,null,null,8853,"Zákány","Somogy"]
[null,null,null,null,null,null,null,null,null,null,null,null,null,null,null,null,null,null,null,null,6787,"Zákányszék","Csongrád"]
[null,null,null,null,null,null,null,null,null,null,null,null,null,null,null,null,null,null,null,null,8660,"Zala","Somogy"]
[null,null,null,null,null,null,null,null,null,null,null,null,null,null,null,null,null,null,null,null,8741,"Zalaapáti","Zala"]
[null,null,null,null,null,null,null,null,null,null,null,null,null,null,null,null,null,null,null,null,8971,"Zalabaksa","Zala"]
[null,null,null,null,null,null,null,null,null,null,null,null,null,null,null,null,null,null,null,null,8798,"Zalabér","Zala"]
[null,null,null,null,null,null,null,null,null,null,null,null,null,null,null,null,null,null,null,null,8992,"Zalaboldogfa","Zala"]
[null,null,null,null,null,null,null,null,null,null,null,null,null,null,null,null,null,null,null,null,8782,"Zalacsány","Zala"]
[null,null,null,null,null,null,null,null,null,null,null,null,null,null,null,null,null,null,null,null,8996,"Zalacséb","Zala"]
[null,null,null,null,null,null,null,null,null,null,null,null,null,null,null,null,null,null,null,null,8900,"Zalaegerszeg","Zala"]
[null,null,null,null,null,null,null,null,null,null,null,null,null,null,null,null,null,null,null,null,8344,"Zalaerdőd","Veszprém"]
[null,null,null,null,null,null,null,null,null,null,null,null,null,null,null,null,null,null,null,null,8349,"Zalagyömörő","Veszprém"]
[null,null,null,null,null,null,null,null,null,null,null,null,null,null,null,null,null,null,null,null,8308,"Zalahaláp","Veszprém"]
[null,null,null,null,null,null,null,null,null,null,null,null,null,null,null,null,null,null,null,null,8997,"Zalaháshágy","Zala"]
[null,null,null,null,null,null,null,null,null,null,null,null,null,null,null,null,null,null,null,null,8761,"Zalaigrice","Zala"]
[null,null,null,null,null,null,null,null,null,null,null,null,null,null,null,null,null,null,null,null,8932,"Zalaistvánd","Zala"]
[null,null,null,null,null,null,null,null,null,null,null,null,null,null,null,null,null,null,null,null,8749,"Zalakaros","Zala"]
[null,null,null,null,null,null,null,null,null,null,null,null,null,null,null,null,null,null,null,null,8751,"Zalakomár","Zala"]
[null,null,null,null,null,null,null,null,null,null,null,null,null,null,null,null,null,null,null,null,8752,"Zalakomár","Zala"]
[null,null,null,null,null,null,null,null,null,null,null,null,null,null,null,null,null,null,null,null,8354,"Zalaköveskút","Zala"]
[null,null,null,null,null,null,null,null,null,null,null,null,null,null,null,null,null,null,null,null,8999,"Zalalövő","Zala"]
[null,null,null,null,null,null,null,null,null,null,null,null,null,null,null,null,null,null,null,null,8348,"Zalameggyes","Veszprém"]
[null,null,null,null,null,null,null,null,null,null,null,null,null,null,null,null,null,null,null,null,8747,"Zalamerenye","Zala"]
[null,null,null,null,null,null,null,null,null,null,null,null,null,null,null,null,null,null,null,null,8756,"Zalasárszeg","Zala"]
[null,null,null,null,null,null,null,null,null,null,null,null,null,null,null,null,null,null,null,null,8743,"Zalaszabar","Zala"]
[null,null,null,null,null,null,null,null,null,null,null,null,null,null,null,null,null,null,null,null,8353,"Zalaszántó","Zala"]
[null,null,null,null,null,null,null,null,null,null,null,null,null,null,null,null,null,null,null,null,8476,"Zalaszegvár","Veszprém"]
[null,null,null,null,null,null,null,null,null,null,null,null,null,null,null,null,null,null,null,null,8772,"Zalaszentbalázs","Zala"]
[null,null,null,null,null,null,null,null,null,null,null,null,null,null,null,null,null,null,null,null,8795,"Zalaszentgrót","Zala"]
[null,null,null,null,null,null,null,null,null,null,null,null,null,null,null,null,null,null,null,null,8793,"Zalaszentgrót","Zala"]
[null,null,null,null,null,null,null,null,null,null,null,null,null,null,null,null,null,null,null,null,8785,"Zalaszentgrót","Zala"]
[null,null,null,null,null,null,null,null,null,null,null,null,null,null,null,null,null,null,null,null,8789,"Zalaszentgrót","Zala"]
[null,null,null,null,null,null,null,null,null,null,null,null,null,null,null,null,null,null,null,null,8790,"Zalaszentgrót","Zala"]
[null,null,null,null,null,null,null,null,null,null,null,null,null,null,null,null,null,null,null,null,8994,"Zalaszentgyörgy","Zala"]
[null,null,null,null,null,null,null,null,null,null,null,null,null,null,null,null,null,null,null,null,8921,"Zalaszentiván","Zala"]
[null,null,null,null,null,null,null,null,null,null,null,null,null,null,null,null,null,null,null,null,8827,"Zalaszentjakab","Zala"]
[null,null,null,null,null,null,null,null,null,null,null,null,null,null,null,null,null,null,null,null,8788,"Zalaszentlászló","Zala"]
[null,null,null,null,null,null,null,null,null,null,null,null,null,null,null,null,null,null,null,null,8921,"Zalaszentlőrinc","Zala"]
[null,null,null,null,null,null,null,null,null,null,null,null,null,null,null,null,null,null,null,null,8764,"Zalaszentmárton","Zala"]
[null,null,null,null,null,null,null,null,null,null,null,null,null,null,null,null,null,null,null,null,8936,"Zalaszentmihály","Zala"]
[null,null,null,null,null,null,null,null,null,null,null,null,null,null,null,null,null,null,null,null,8969,"Zalaszombatfa","Zala"]
[null,null,null,null,null,null,null,null,null,null,null,null,null,null,null,null,null,null,null,null,7839,"Zaláta","Baranya"]
[null,null,null,null,null,null,null,null,null,null,null,null,null,null,null,null,null,null,null,null,8947,"Zalatárnok","Zala"]
[null,null,null,null,null,null,null,null,null,null,null,null,null,null,null,null,null,null,null,null,8822,"Zalaújlak","Zala"]
[null,null,null,null,null,null,null,null,null,null,null,null,null,null,null,null,null,null,null,null,8392,"Zalavár","Zala"]
[null,null,null,null,null,null,null,null,null,null,null,null,null,null,null,null,null,null,null,null,8792,"Zalavég","Zala"]
[null,null,null,null,null,null,null,null,null,null,null,null,null,null,null,null,null,null,null,null,3957,"Zalkod","Borsod-Abaúj-Zemplén"]
[null,null,null,null,null,null,null,null,null,null,null,null,null,null,null,null,null,null,null,null,8621,"Zamárdi","Somogy"]
[null,null,null,null,null,null,null,null,null,null,null,null,null,null,null,null,null,null,null,null,8081,"Zámoly","Fejér"]
[null,null,null,null,null,null,null,null,null,null,null,null,null,null,null,null,null,null,null,null,8251,"Zánka","Veszprém"]
[null,null,null,null,null,null,null,null,null,null,null,null,null,null,null,null,null,null,null,null,3296,"Zaránk","Heves"]
[null,null,null,null,null,null,null,null,null,null,null,null,null,null,null,null,null,null,null,null,7182,"Závod","Tolna"]
[null,null,null,null,null,null,null,null,null,null,null,null,null,null,null,null,null,null,null,null,8957,"Zebecke","Zala"]
[null,null,null,null,null,null,null,null,null,null,null,null,null,null,null,null,null,null,null,null,2627,"Zebegény","Pest"]
[null,null,null,null,null,null,null,null,null,null,null,null,null,null,null,null,null,null,null,null,3977,"Zemplénagárd","Borsod-Abaúj-Zemplén"]
[null,null,null,null,null,null,null,null,null,null,null,null,null,null,null,null,null,null,null,null,7720,"Zengővárkony","Baranya"]
[null,null,null,null,null,null,null,null,null,null,null,null,null,null,null,null,null,null,null,null,8112,"Zichyújfalu","Fejér"]
[null,null,null,null,null,null,null,null,null,null,null,null,null,null,null,null,null,null,null,null,8672,"Zics","Somogy"]
[null,null,null,null,null,null,null,null,null,null,null,null,null,null,null,null,null,null,null,null,3794,"Ziliz","Borsod-Abaúj-Zemplén"]
[null,null,null,null,null,null,null,null,null,null,null,null,null,null,null,null,null,null,null,null,7471,"Zimány","Somogy"]
[null,null,null,null,null,null,null,null,null,null,null,null,null,null,null,null,null,null,null,null,8420,"Zirc","Veszprém"]
[null,null,null,null,null,null,null,null,null,null,null,null,null,null,null,null,null,null,null,null,7671,"Zók","Baranya"]
[null,null,null,null,null,null,null,null,null,null,null,null,null,null,null,null,null,null,null,null,7173,"Zomba","Tolna"]
[null,null,null,null,null,null,null,null,null,null,null,null,null,null,null,null,null,null,null,null,5537,"Zsadány","Békés"]
[null,null,null,null,null,null,null,null,null,null,null,null,null,null,null,null,null,null,null,null,4142,"Zsáka","Hajdú-Bihar"]
[null,null,null,null,null,null,null,null,null,null,null,null,null,null,null,null,null,null,null,null,2072,"Zsámbék","Pest"]
[null,null,null,null,null,null,null,null,null,null,null,null,null,null,null,null,null,null,null,null,2116,"Zsámbok","Pest"]
[null,null,null,null,null,null,null,null,null,null,null,null,null,null,null,null,null,null,null,null,6411,"Zsana","Bács-Kiskun"]
[null,null,null,null,null,null,null,null,null,null,null,null,null,null,null,null,null,null,null,null,4961,"Zsarolyán","Szabolcs-Szatmár-Bereg"]
[null,null,null,null,null,null,null,null,null,null,null,null,null,null,null,null,null,null,null,null,9346,"Zsebeháza","Győr-Moson-Sopron"]
[null,null,null,null,null,null,null,null,null,null,null,null,null,null,null,null,null,null,null,null,9635,"Zsédeny","Vas"]
[null,null,null,null,null,null,null,null,null,null,null,null,null,null,null,null,null,null,null,null,7477,"Zselickisfalud","Somogy"]
[null,null,null,null,null,null,null,null,null,null,null,null,null,null,null,null,null,null,null,null,7400,"Zselickislak","Somogy"]
[null,null,null,null,null,null,null,null,null,null,null,null,null,null,null,null,null,null,null,null,7474,"Zselicszentpál","Somogy"]
[null,null,null,null,null,null,null,null,null,null,null,null,null,null,null,null,null,null,null,null,9766,"Zsennye","Vas"]
[null,null,null,null,null,null,null,null,null,null,null,null,null,null,null,null,null,null,null,null,9476,"Zsira","Győr-Moson-Sopron"]
[null,null,null,null,null,null,null,null,null,null,null,null,null,null,null,null,null,null,null,null,6792,"Zsombó","Csongrád"]
[null,null,null,null,null,null,null,null,null,null,null,null,null,null,null,null,null,null,null,null,3897,"Zsujta","Borsod-Abaúj-Zemplén"]
[null,null,null,null,null,null,null,null,null,null,null,null,null,null,null,null,null,null,null,null,4627,"Zsurk","Szabolcs-Szatmár-Bereg"]
[null,null,null,null,null,null,null,null,null,null,null,null,null,null,null,null,null,null,null,null,3723,"Zubogy","Borsod-Abaúj-Zemplén"]

{"sheet":"Kulcs-Soft","index":1,"n_rows":9,"n_cols":107,"rows_kept":9,"cut":false,"hidden":true,"merged":[]}
["Személyi adatok",null,null,null,null,null,null,null,null,null,null,null,null,null,null,"Elérhetőség",null,null,null,null,null,null,null,null,null,null,"Levelezési cím",null,null,null,null,null,null,null,null,null,null,"Telefon",null,null,null,null,null,"Nyugdíj",null,"Banki adatok",null,"Iskolai végzettség",null,null,null,"Jogviszony alapadatok",null,null,null,null,null,null,null,null,null,null,null,null,null,null,null,null,"Törzsbér",null,"Személyi alapbér",null,null,"Szerződés szerinti bér",null,"Jövedelem kifizetés","Szabadság adatok","Adókedvezmények/adóalap kedvezmények",null,null,null,null,null,null,null,"Munkáltatói kedvezmények",null,null,null,null,"Karrier híd program kedvezmény","Egyéb adatok","Munkaidő keret",null,null,null,null,null,null,null,null,"Munkaerő kölcsönzés"]
["Sorszám","Vezetéknév","Keresztnév","Születési vezetéknév","Születési keresztnév","Adóazonosító","TAJ-szám","Anyja születési neve","Születési dátum","Születési ország","Születési hely","Nem","Állampolgárság","Előnév","Családi állapot","Irányítószám","Város","Közterület","Közterület jellege","Házszám","Épület","Lépcsőház","Emelet","Ajtó","Terület","Ország","Irányítószám Levelezési","Város Levelezési","Közterület Levelezési","Közterület jellege Levelezési","Házszám Levelezési","Épület Levelezési","Lépcsőház Levelezési","Emelet Levelezési","Ajtó Levelezési","Terület Levelezési","Ország Levelezési","Ország előhívó","Körzet","Telefonszám","Mellék","E-mail cím","Elektronikus bérjegyzék E-mail cím","Nyugdíj kezdete","Nyugdíj típusa (apeh kód)","Bank (kód)","Bankszámlaszám","Iskola neve","Bizonyítvány száma","Szakképesítés (OKJ kód)","Megszerzés dátuma","Jogviszony kezdete","Kilépés dátuma","Kilépés mód (kód)","Határozott idejű","Határozott idő várh. vége","Foglalkozási viszony (kód)","Munkarend (kód)","Jogviszony megnevezése","FEOR","Részletes jelenlétadat nyilvántartás használata","Telephely (Kód)","Költséghely (Kód)","Szervezeti egység (kód)","Munkakör (Kód)","Munkaszám (Kód)","Részlegszám (Kód)","Másodlagos főkönyvi szám","Bér típusa","Bér összege","Fizetési osztály","Fizetési fokozat","Garantált illetmény növekmény(%)","Szerződés szerinti bér típusa","Szerződés szerinti bér összege","Kifizetés módja","Szabadság nyilvántartás órában","Súlyos fogyatékos kedv. mértéke","Családi adóalapkedv. összege","Csal. adóalapkedv. megosztás","Csal. járulékkedv. igénybevétel","Első házasok kedv. Összege","Házasságkötés időpontja","Érvényesség utolsó hónapja","Első házasok kedv. megosztás","Kedvezmény (kód)","GYES/GYET/GYED mellett fogl.","Anyasági ell. megszünése","Jogosultság, vagy GYES/GYET/GYED mellett fogl. kezd.","legfeljebb 180 nap munkaviszony","Karrier híd","Import azonosító","Kezdő dátum","Záró dátum","Munkaidőkeret típusa","Vállalt havi óraszám","Óraszám","Órabéres havi elszámolt óraszáma","Teljesített óraszám","Ebből ledolgozott óraszám","Nem fizetett magáncélú távollét óraszáma","Év végi óraszám egyenleg","Munkaerő kölcs. kezdete","Munkaerő kölcs. vége","Munkaerő kölcs. partner (sorszám)","Munkaerő kölcs. időarányos szab.","Munkaerő kölcs. rehab. jár. számításnál létsz. nem számító"]
[null,{"$f":"Adatlap!C7","v":0},{"$f":"IF(ISBLANK(Adatlap!E7),Adatlap!D7,CONCATENATE(Adatlap!D7,\" \",Adatlap!E7))","v":0},{"$f":"Adatlap!C8","v":0},{"$f":"IF(ISBLANK(Adatlap!E8),Adatlap!D8,CONCATENATE(Adatlap!D8,\" \",Adatlap!E8))","v":0},{"$f":"Adatlap!C16","v":0},{"$f":"Adatlap!E16","v":0},{"$f":"IF(ISBLANK(Adatlap!E9),CONCATENATE(Adatlap!C9,\" \",Adatlap!D9),CONCATENATE(Adatlap!C9,\" \",Adatlap!D9,\" \",Adatlap!E9))","v":" "},{"$f":"CONCATENATE(Adatlap!C14,\".\",Adatlap!D14,\".\",Adatlap!E14)","v":".."},{"$f":"Adatlap!C12","v":"Magyarország"},{"$f":"Adatlap!D12","v":0},{"$f":"IF(Adatlap!G7=\"nő\",2,IF(Adatlap!G7=\"férfi\",1,\"!!!\"))","v":1},{"$f":"Adatlap!C10","v":0},null,null,{"$f":"Adatlap!D21","v":0},{"$f":"Adatlap!E21","v":0},{"$f":"Adatlap!F21","v":0},{"$f":"Adatlap!G21","v":0},{"$f":"Adatlap!H21","v":0},{"$f":"Adatlap!I21","v":0},{"$f":"Adatlap!J21","v":0},{"$f":"Adatlap!K21","v":0},{"$f":"Adatlap!L21","v":0},{"$f":"Adatlap!M21","v":0},{"$f":"Adatlap!C21","v":0},{"$f":"Adatlap!D22","v":0},{"$f":"Adatlap!E22","v":0},{"$f":"Adatlap!F22","v":0},{"$f":"Adatlap!G22","v":0},{"$f":"Adatlap!H22","v":0},{"$f":"Adatlap!I22","v":0},{"$f":"Adatlap!J22","v":0},{"$f":"Adatlap!K22","v":0},{"$f":"Adatlap!L22","v":0},{"$f":"Adatlap!M22","v":0},{"$f":"Adatlap!C22","v":0},36,{"$f":"Adatlap!C29","v":"Kérem válasszon!"},{"$f":"Adatlap!D29","v":0},null,{"$f":"Adatlap!C28","v":0},null,null,null,null,null,null,null,null,null,{"$f":"Adatlap!G31","v":"00:00:00"},null,null,null,null,null,{"$f":"Adatlap!C33","v":"Kérem válasszon!"},null,{"$f":"_xlfn.IFNA(VLOOKUP(Adatlap!$C$32,FEOR!$A$2:$C$486,3,FALSE),\"\")","v":""},"N",null,null,null,{"$f":"IF(ISNUMBER(VLOOKUP(Adatlap!C32,FEOR!$A$2:$C$486,3,FALSE)),Adatlap!C32,\"Nem a listából választott név!\")","v":"Nem a listából választott név!"},null,null,null,{"$f":"IF(BF3=BF9,\"megbízási díj\",VLOOKUP(Adatlap!G32,'Kulcs-Soft'!$BP$5:$BQ$8,2,FALSE))","v":{"$error":"#N/A"}},{"$f":"Adatlap!G32","v":"Kérem válasszon!"}]
[null,null,null,null,null,null,null,null,null,null,null,null,null,null,null,null,null,null,null,null,null,null,null,null,null,null,null,null,null,null,null,null,null,null,null,null,null,null,null,null,null,null,null,null,null,null,null,null,null,null,null,null,null,null,null,null,null,"Kérem válasszon!",null,null,null,null,null,null,null,null,null,"Kérem válasszon!"]
[null,null,null,null,null,null,null,null,null,null,null,null,null,null,null,null,null,null,null,null,null,null,null,null,null,null,null,null,null,null,null,null,null,null,null,null,null,null,null,null,null,null,null,null,null,null,null,null,null,null,null,null,null,null,null,null,null,2,null,null,null,null,null,null,null,null,null,"Havi bér","HB"]
[null,null,null,null,null,null,null,null,null,null,null,null,null,null,null,null,null,null,null,null,null,null,null,null,null,null,null,null,null,null,null,null,null,null,null,null,null,null,null,null,null,null,null,null,null,null,null,null,null,null,null,null,null,null,null,null,null,4,null,null,null,null,null,null,null,null,null,"Heti bér","HEB"]
[null,null,null,null,null,null,null,null,null,null,null,null,null,null,null,null,null,null,null,null,null,null,null,null,null,null,null,null,null,null,null,null,null,null,null,null,null,null,null,null,null,null,null,null,null,null,null,null,null,null,null,null,null,null,null,null,null,6,null,null,null,null,null,null,null,null,null,"Napi bér","NB"]
[null,null,null,null,null,null,null,null,null,null,null,null,null,null,null,null,null,null,null,null,null,null,null,null,null,null,null,null,null,null,null,null,null,null,null,null,null,null,null,null,null,null,null,null,null,null,null,null,null,null,null,null,null,null,null,null,null,8,null,null,null,null,null,null,null,null,null,"Óra bér","OB"]
[null,null,null,null,null,null,null,null,null,null,null,null,null,null,null,null,null,null,null,null,null,null,null,null,null,null,null,null,null,null,null,null,null,null,null,null,null,null,null,null,null,null,null,null,null,null,null,null,null,null,null,null,null,null,null,null,null,"megbízási"]

{"sheet":"BANK","index":2,"n_rows":101,"n_cols":4,"rows_kept":101,"cut":false,"hidden":true,"merged":[]}
["bankszámla szém első száma","Bank","kód"]
[11734286," OTP Észak","keleti r., Miskolc "," Auch, 3527 Miskolc, József A. u. 87."]
[64800028," B3 TAKARÉK Szövetkezet, 2030 Érd, Fürdő u. 1.","keleti r., Miskolc "," Auchan, 3527 Miskolc, József A. u. 87."]
[12001008," Raiffeisen Bank Zrt. Budapesti Fiók, 1054 Budapest, Akadémia u. 6."]
[50300147," MECSEK TAKARÉK Szövetkezet, 7030 Paks, Villany u. 4."]
[58100051," Sárbogárd és Vidéke Takarékszövetkezet, 7013 Cece, Deák Ferenc u. 6."]
[18203648," FHB Bank Zrt. 364 MP Fiók K"]
[61200113," Polgári Takarékszövetkezet, 4090 Polgár, Hősök útja 8."]
[10409015," K&H Bank Zrt. 901 Budapest, 1146 Budapest, Ajtósi Dürer sor 10."]
[11773384," OTP Hajdú"]
[10103898," Budapest Bank Zrt. Váci fiók, 2600 Vác, Köztársaság u. 10."]
[10700615," CIB Bank Zrt. Rákoskeresztúri fiók, 1173 Budapest, Pesti út 170."]
[55800123," Szerencs és Környéke Takarékszövetk, 3909 Mád, Rákóczi F. u. 49.","Magyaro., 1082 Budapest, Üllői út 48."]
[10700749," CIB Bank Zrt. Siófoki fiók, 8600 Siófok, Szabadság tér 15.","Magyaro, 1082 Budapest, Üllői út 48."]
[10700024," CIB Bank Zrt Medve u. fiók, 1027 Budapest, Medve u. 4"]
[10702143," CIB Bank Zrt. Piliscsabai fiók, 2081 Piliscsaba, Kinizsi u. 1"]
[11773535," OTP Fejér megyei LAFO fiók, 8000 Székesféhervár, Ősz u. 13."]
[10047004," Magyar Államkincstár. Szombathely, 9700 Szombathely, Széll Kálmán u. 20.","Bihar megyei LAFO fiók, 4025 Debrecen, Piac u. 45","47."]
[10918001," UniCredit Bank Hungary Zrt. Head Of, 1054 Budapest, Szabadság tér 5"]
[10400566," K&H Bank Zrt. 056 Jászberény, 5100 Jászberény, Szabadság tér 1."]
[10205000," K&H Bank Zrt. Lakosság, 1095 Budapest, Lechner Ödön fasor 9."]
[53700072," Békés Takarék Szövetkezet, 5553 Kondoros, Csabai út 14."]
[10023002," Magyar Államkincstár. Budapest, 1139 Bp., Váci út 71."]
[11773494," OTP Zala megyei LAFO fiók, 8900 Zalaegerszeg, Kisfaludy u. 15"]
[14100237," Sberbank Magyarország Zrt Zugló, 1144 Budapest, Hungária krt. 140"]
[10400054," K&H Bank Zrt. 105 Budapest, 1036 Budapest, Bécsi út 57"]
[16300000," Deutsche Bank Europe GmbH Mo","14."]
[12072552," Raiffeisen Bank Zrt. Pécs III., 7621 Pécs, Irgalmasok útja 5.","3."]
[10103104," Budapest Bank Zrt. Nyugati téri fió, 1132 Budapest, Nyugati tér 4","9."]
[69300114," Fegyvernek és Vid. Körz. Takszöv, 5231 Fegyvernek, Szent Erzsébet út 138."]
[11773456," OTP Jász"]
[73200158," Kinizsi Bank Zrt., 1122 Budapest, Krisztina körút 2.","6."]
[10700354," CIB Bank Zrt. Bajai fiók, 6500 Baja, Déri Fr. sétány 1","6."]
[11991119," Erste Bank Nyrt Lakossági folyószámla, 1138 Budapest, Népfürdő u. 24"]
[10103551," Budapest Bank Zrt. Gyöngyösi fiók, 3200 Gyöngyös, Fő tér 19."]
[10403181," K&H Bank Zrt. 318 Budapest, 1024 Budapest, Margit krt. 43","79."]
[70600092," Dunaföldvár és Vidéke Takarékszövet, 7056 Szedres, Arany J. u. 2."]
[72600115," SAVARIA Takarékszövetkezet, 9653 Répcelak, Petőfi u. 50."]
[10104789," Budapest Bank Zrt. Szombathelyi fió, 9700 Szombathely, Kőszegi u. 3/a."]
[11600006," Erste Bank Zrt., 1138 Budapest, Népfürdő u. 24","17."]
[12010501," Raiffeisen Bank Zrt. Akadémia utcai Fiók, 1054 Budapest, Akadémia u. 6.","144."]
[10700732," CIB Bank Zrt. Oktogon fiók, 1064 Budapest, Teréz krt. 21."]
[11650001," Erste Bank Zrt., 1138 Budapest, Népfürdő u. 24","144."]
[10404436," K&H Bank Zrt. 443 Kisvárda, 4600 Kisvárda, Somogyi Rezső út 11.","61."]
[14220108," COMMERZBANK ZRT., 1054 Budapest, Széchenyi rkp. 8.","i Fióktelep, 1054 Budapest, Hold u. 27."]
[10400669," K&H Bank Zrt. 066 Kőszeg, 9730 Kőszeg, Fő tér 4."]
[10404845," K&H Bank Zrt. 484 Pápa, 8500 Pápa, Kossuth L. u. 21."]
[11740030," OTP Észak"]
[10403112," K&H Bank Zrt. 311 Szentendre, 2000 Szentendre, Fő tér 10."]
[12083002," Raiffeisen Bank Zrt. Tapolca, 8300 Tapolca, Fő tér 4","5."]
[71800305," Hungária Takarék Takarékszövetkezet, 7144 Decs, Pilissy u. 3/A.","5."]
[10300002," MKB Bank Zrt., 1056 Budapest, Váci utca 38.","5."]
[11737083," OTP Észak"]
[11773315," OTP Baranya megyei LAFO fiók, 7621 Pécs, Rákóczi út 44."]
[18100002," FHB Bank Budapest 2. fiók, 1082 Budapest, Üllői út 48."]
[63300123," Pannon Takarék Bank Oroszlányi fiók, 2840 Oroszlány, Rákóczi F. u. 7/a","Nagykun","Szolnok megyei LAF, 5000 Szolnok, Nagy Imre krt. 2/a."]
[88000019," Fundamenta","Nagykun","Szolnok megyei LAFO f., 5000 Szolnok, Nagy Imre krt. 2/a."]
[]
[null,null,"3."]
[null,null,"26."]
[null,null,"26."]
[]
[]
[null,null,"45."]
[]
[]
[]
[]
[]
[]
[]
[]
[]
[]
[null,null,"26."]
[null,null,"26."]
[]
[]
[]
[]
[null,null,"26."]
[null,null,"26."]
[]
[]
[]
[]
[null,null,"dunántúli r., Komárom, 2900 Komárom, Mártírok útja 23."]
[]
[null,null,"6."]
[null,null,"3."]
[]
[]
[]
[]
[null,null,"dunántúli r., Sopron, 9400 Sopron, Várkerület 96/a."]
[]
[]
[]
[]
[null,null,"Bokod Takarékszövetkezet, 2840 Oroszlány, Rákóczi F. u. 7/a"]
[null,null,"Lakáskassza Zrt., 1052 Budapest, Váci u. 19","21."]

{"sheet":"Munka1","index":3,"n_rows":0,"n_cols":0,"rows_kept":0,"cut":false,"hidden":true,"merged":[]}

{"sheet":"FEOR","index":4,"n_rows":486,"n_cols":10,"rows_kept":486,"cut":false,"hidden":true,"merged":[]}
["Megnevezés","Állománycsoport","Kód","IF Found","Frequency","Searchable list",null,null,null,{"$f":"Adatlap!$C$32","v":0}]
["Egyszerű erdészeti, vadászati és halászati foglalkozású","Fizikai",9332,{"$f":"--ISNUMBER(SEARCH(Adatlap!$C$32,FEOR!A2))","v":1},{"$f":"IF(D2=1,SUMIF($D$2:D2,1),\"\")","v":1},{"$f":"IFERROR(INDEX($A$2:$A$486,MATCH(ROW(F1),$E$2:$E$486,0)),\"\")","v":"Egyszerű erdészeti, vadászati és halászati foglalkozású"}]
["Egyszerű mezőgazdasági foglalkozású","Fizikai",9331,{"$f":"--ISNUMBER(SEARCH(Adatlap!$C$32,FEOR!A3))","v":1},{"$f":"IF(D3=1,SUMIF($D$2:D3,1),\"\")","v":2},{"$f":"IFERROR(INDEX($A$2:$A$486,MATCH(ROW(F2),$E$2:$E$486,0)),\"\")","v":"Egyszerű mezőgazdasági foglalkozású"}]
["Egyéb egyszerű építőipari foglalkozású","Fizikai",9329,{"$f":"--ISNUMBER(SEARCH(Adatlap!$C$32,FEOR!A4))","v":1},{"$f":"IF(D4=1,SUMIF($D$2:D4,1),\"\")","v":3},"Egyéb egyszerű építőipari foglalkozású"]
["Kubikos","Fizikai",9321,{"$f":"--ISNUMBER(SEARCH(Adatlap!$C$32,FEOR!A5))","v":1},{"$f":"IF(D5=1,SUMIF($D$2:D5,1),\"\")","v":4},"Kubikos"]
["Egyszerű ipari foglalkozású","Fizikai",9310,{"$f":"--ISNUMBER(SEARCH(Adatlap!$C$32,FEOR!A6))","v":1},{"$f":"IF(D6=1,SUMIF($D$2:D6,1),\"\")","v":5},"Egyszerű ipari foglalkozású"]
["Egyéb, máshova nem sorolható egyszerű szolgáltatási és szállítási foglalkozású","Fizikai",9239,{"$f":"--ISNUMBER(SEARCH(Adatlap!$C$32,FEOR!A7))","v":1},{"$f":"IF(D7=1,SUMIF($D$2:D7,1),\"\")","v":6},"Egyéb, máshova nem sorolható egyszerű szolgáltatási és szállítási foglalkozású"]
["Parkolóőr","Fizikai",9238,{"$f":"--ISNUMBER(SEARCH(Adatlap!$C$32,FEOR!A8))","v":1},{"$f":"IF(D8=1,SUMIF($D$2:D8,1),\"\")","v":7},"Parkolóőr"]
["Háztartási alkalmazott","Fizikai",9237,{"$f":"--ISNUMBER(SEARCH(Adatlap!$C$32,FEOR!A9))","v":1},{"$f":"IF(D9=1,SUMIF($D$2:D9,1),\"\")","v":8},"Háztartási alkalmazott"]
["Konyhai kisegítő","Fizikai",9236,{"$f":"--ISNUMBER(SEARCH(Adatlap!$C$32,FEOR!A10))","v":1},{"$f":"IF(D10=1,SUMIF($D$2:D10,1),\"\")","v":9},"Konyhai kisegítő"]
["Gyorséttermi eladó","Fizikai",9235,{"$f":"--ISNUMBER(SEARCH(Adatlap!$C$32,FEOR!A11))","v":1},{"$f":"IF(D11=1,SUMIF($D$2:D11,1),\"\")","v":10},"Gyorséttermi eladó"]
["Hordár, csomagkihordó","Fizikai",9234,{"$f":"--ISNUMBER(SEARCH(Adatlap!$C$32,FEOR!A12))","v":1},{"$f":"IF(D12=1,SUMIF($D$2:D12,1),\"\")","v":11},"Hordár, csomagkihordó"]
["Hivatalsegéd, kézbesítő","Fizikai",9233,{"$f":"--ISNUMBER(SEARCH(Adatlap!$C$32,FEOR!A13))","v":1},{"$f":"IF(D13=1,SUMIF($D$2:D13,1),\"\")","v":12},"Hivatalsegéd, kézbesítő",{"$f":"$F$2:INDEX($F$2:$F$486,COUNTIF($F$2:$F$486,\"?*\"))","v":"Hivatalsegéd, kézbesítő"}]
["Mérőóra-leolvasó és hasonló egyszerű foglalkozású","Fizikai",9232,{"$f":"--ISNUMBER(SEARCH(Adatlap!$C$32,FEOR!A14))","v":1},{"$f":"IF(D14=1,SUMIF($D$2:D14,1),\"\")","v":13},"Mérőóra-leolvasó és hasonló egyszerű foglalkozású"]
["Portás, telepőr, egyszerű őr","Fizikai",9231,{"$f":"--ISNUMBER(SEARCH(Adatlap!$C$32,FEOR!A15))","v":1},{"$f":"IF(D15=1,SUMIF($D$2:D15,1),\"\")","v":14},"Portás, telepőr, egyszerű őr"]
["Kézi csomagoló","Fizikai",9225,{"$f":"--ISNUMBER(SEARCH(Adatlap!$C$32,FEOR!A16))","v":1},{"$f":"IF(D16=1,SUMIF($D$2:D16,1),\"\")","v":15},"Kézi csomagoló"]
["Pultfeltöltő, árufeltöltő","Fizikai",9224,{"$f":"--ISNUMBER(SEARCH(Adatlap!$C$32,FEOR!A17))","v":1},{"$f":"IF(D17=1,SUMIF($D$2:D17,1),\"\")","v":16},"Pultfeltöltő, árufeltöltő"]
["Rakodómunkás","Fizikai",9223,{"$f":"--ISNUMBER(SEARCH(Adatlap!$C$32,FEOR!A18))","v":1},{"$f":"IF(D18=1,SUMIF($D$2:D18,1),\"\")","v":17},"Rakodómunkás"]
["Állati erővel vont jármű hajtója","Fizikai",9222,{"$f":"--ISNUMBER(SEARCH(Adatlap!$C$32,FEOR!A19))","v":1},{"$f":"IF(D19=1,SUMIF($D$2:D19,1),\"\")","v":18},"Állati erővel vont jármű hajtója"]
["Pedálos vagy kézi hajtású gépek vezetője","Fizikai",9221,{"$f":"--ISNUMBER(SEARCH(Adatlap!$C$32,FEOR!A20))","v":1},{"$f":"IF(D20=1,SUMIF($D$2:D20,1),\"\")","v":19},"Pedálos vagy kézi hajtású gépek vezetője"]
["Hulladékosztályozó","Fizikai",9212,{"$f":"--ISNUMBER(SEARCH(Adatlap!$C$32,FEOR!A21))","v":1},{"$f":"IF(D21=1,SUMIF($D$2:D21,1),\"\")","v":20},"Hulladékosztályozó"]
["Szemétgyűjtő, utcaseprő","Fizikai",9211,{"$f":"--ISNUMBER(SEARCH(Adatlap!$C$32,FEOR!A22))","v":1},{"$f":"IF(D22=1,SUMIF($D$2:D22,1),\"\")","v":21},"Szemétgyűjtő, utcaseprő"]
["Egyéb takarító és kisegítő","Fizikai",9119,{"$f":"--ISNUMBER(SEARCH(Adatlap!$C$32,FEOR!A23))","v":1},{"$f":"IF(D23=1,SUMIF($D$2:D23,1),\"\")","v":22},"Egyéb takarító és kisegítő"]
["Ablaktisztító","Fizikai",9115,{"$f":"--ISNUMBER(SEARCH(Adatlap!$C$32,FEOR!A24))","v":1},{"$f":"IF(D24=1,SUMIF($D$2:D24,1),\"\")","v":23},"Ablaktisztító"]
["Járműtakarító","Fizikai",9114,{"$f":"--ISNUMBER(SEARCH(Adatlap!$C$32,FEOR!A25))","v":1},{"$f":"IF(D25=1,SUMIF($D$2:D25,1),\"\")","v":24},"Járműtakarító"]
["Kézi mosó, vasaló","Fizikai",9113,{"$f":"--ISNUMBER(SEARCH(Adatlap!$C$32,FEOR!A26))","v":1},{"$f":"IF(D26=1,SUMIF($D$2:D26,1),\"\")","v":25},"Kézi mosó, vasaló"]
["Intézményi takarító és kisegítő ","Fizikai",9112,{"$f":"--ISNUMBER(SEARCH(Adatlap!$C$32,FEOR!A27))","v":1},{"$f":"IF(D27=1,SUMIF($D$2:D27,1),\"\")","v":26},"Intézményi takarító és kisegítő "]
["Háztartási takarító és kisegítő","Fizikai",9111,{"$f":"--ISNUMBER(SEARCH(Adatlap!$C$32,FEOR!A28))","v":1},{"$f":"IF(D28=1,SUMIF($D$2:D28,1),\"\")","v":27},"Háztartási takarító és kisegítő"]
["Hajószemélyzet, kormányos, matróz","Fizikai",8430,{"$f":"--ISNUMBER(SEARCH(Adatlap!$C$32,FEOR!A29))","v":1},{"$f":"IF(D29=1,SUMIF($D$2:D29,1),\"\")","v":28},"Hajószemélyzet, kormányos, matróz"]
["Targoncavezető","Fizikai",8425,{"$f":"--ISNUMBER(SEARCH(Adatlap!$C$32,FEOR!A30))","v":1},{"$f":"IF(D30=1,SUMIF($D$2:D30,1),\"\")","v":29},"Targoncavezető"]
["Daru, felvonó és hasonló anyagmozgató gép kezelője","Fizikai",8424,{"$f":"--ISNUMBER(SEARCH(Adatlap!$C$32,FEOR!A31))","v":1},{"$f":"IF(D31=1,SUMIF($D$2:D31,1),\"\")","v":30},"Daru, felvonó és hasonló anyagmozgató gép kezelője"]
["Köztisztasági, településtisztasági gép kezelője","Fizikai",8423,{"$f":"--ISNUMBER(SEARCH(Adatlap!$C$32,FEOR!A32))","v":1},{"$f":"IF(D32=1,SUMIF($D$2:D32,1),\"\")","v":31},"Köztisztasági, településtisztasági gép kezelője"]
["Földmunkagép és hasonló könnyű- és nehézgép kezelője","Fizikai",8422,{"$f":"--ISNUMBER(SEARCH(Adatlap!$C$32,FEOR!A33))","v":1},{"$f":"IF(D33=1,SUMIF($D$2:D33,1),\"\")","v":32},"Földmunkagép és hasonló könnyű- és nehézgép kezelője"]
["Mezőgazdasági, erdőgazdasági, növényvédő gépkezelő","Fizikai",8421,{"$f":"--ISNUMBER(SEARCH(Adatlap!$C$32,FEOR!A34))","v":1},{"$f":"IF(D34=1,SUMIF($D$2:D34,1),\"\")","v":33},"Mezőgazdasági, erdőgazdasági, növényvédő gépkezelő"]
["Egyéb járművezető és kapcsolódó foglalkozású","Fizikai",8419,{"$f":"--ISNUMBER(SEARCH(Adatlap!$C$32,FEOR!A35))","v":1},{"$f":"IF(D35=1,SUMIF($D$2:D35,1),\"\")","v":34},"Egyéb járművezető és kapcsolódó foglalkozású"]
["Autóbuszvezető","Fizikai",8418,{"$f":"--ISNUMBER(SEARCH(Adatlap!$C$32,FEOR!A36))","v":1},{"$f":"IF(D36=1,SUMIF($D$2:D36,1),\"\")","v":35},"Autóbuszvezető"]
["Tehergépkocsi-vezető, kamionsofőr","Fizikai",8417,{"$f":"--ISNUMBER(SEARCH(Adatlap!$C$32,FEOR!A37))","v":1},{"$f":"IF(D37=1,SUMIF($D$2:D37,1),\"\")","v":36},"Tehergépkocsi-vezető, kamionsofőr"]
["Személygépkocsi-vezető","Fizikai",8416,{"$f":"--ISNUMBER(SEARCH(Adatlap!$C$32,FEOR!A38))","v":1},{"$f":"IF(D38=1,SUMIF($D$2:D38,1),\"\")","v":37},"Személygépkocsi-vezető"]
["Trolibuszvezető","Fizikai",8415,{"$f":"--ISNUMBER(SEARCH(Adatlap!$C$32,FEOR!A39))","v":1},{"$f":"IF(D39=1,SUMIF($D$2:D39,1),\"\")","v":38},"Trolibuszvezető"]
["Metróvezető","Fizikai",8414,{"$f":"--ISNUMBER(SEARCH(Adatlap!$C$32,FEOR!A40))","v":1},{"$f":"IF(D40=1,SUMIF($D$2:D40,1),\"\")","v":39},"Metróvezető"]
["Villamosvezető","Fizikai",8413,{"$f":"--ISNUMBER(SEARCH(Adatlap!$C$32,FEOR!A41))","v":1},{"$f":"IF(D41=1,SUMIF($D$2:D41,1),\"\")","v":40},"Villamosvezető"]
["Vasútijármű-vezetéshez kapcsolódó foglalkozású","Fizikai",8412,{"$f":"--ISNUMBER(SEARCH(Adatlap!$C$32,FEOR!A42))","v":1},{"$f":"IF(D42=1,SUMIF($D$2:D42,1),\"\")","v":41},"Vasútijármű-vezetéshez kapcsolódó foglalkozású"]
["Mozdonyvezető","Fizikai",8411,{"$f":"--ISNUMBER(SEARCH(Adatlap!$C$32,FEOR!A43))","v":1},{"$f":"IF(D43=1,SUMIF($D$2:D43,1),\"\")","v":42},"Mozdonyvezető"]
["Egyéb, máshova nem sorolható, helyhez kötött gép kezelője","Fizikai",8329,{"$f":"--ISNUMBER(SEARCH(Adatlap!$C$32,FEOR!A44))","v":1},{"$f":"IF(D44=1,SUMIF($D$2:D44,1),\"\")","v":43},"Egyéb, máshova nem sorolható, helyhez kötött gép kezelője"]
["Mosodai gép kezelője","Fizikai",8327,{"$f":"--ISNUMBER(SEARCH(Adatlap!$C$32,FEOR!A45))","v":1},{"$f":"IF(D45=1,SUMIF($D$2:D45,1),\"\")","v":44},"Mosodai gép kezelője"]
["Mozigépész, vetítőgépész","Fizikai",8326,{"$f":"--ISNUMBER(SEARCH(Adatlap!$C$32,FEOR!A46))","v":1},{"$f":"IF(D46=1,SUMIF($D$2:D46,1),\"\")","v":45},"Mozigépész, vetítőgépész"]
["Csomagoló-, palackozó- és címkézőgép kezelője","Fizikai",8325,{"$f":"--ISNUMBER(SEARCH(Adatlap!$C$32,FEOR!A47))","v":1},{"$f":"IF(D47=1,SUMIF($D$2:D47,1),\"\")","v":46},"Csomagoló-, palackozó- és címkézőgép kezelője"]
["Sugármentesítő gép, berendezés kezelője","Fizikai",8324,{"$f":"--ISNUMBER(SEARCH(Adatlap!$C$32,FEOR!A48))","v":1},{"$f":"IF(D48=1,SUMIF($D$2:D48,1),\"\")","v":47},"Sugármentesítő gép, berendezés kezelője"]
["Kazángépkezelő","Fizikai",8323,{"$f":"--ISNUMBER(SEARCH(Adatlap!$C$32,FEOR!A49))","v":1},{"$f":"IF(D49=1,SUMIF($D$2:D49,1),\"\")","v":48},"Kazángépkezelő"]
["Vízgazdálkodási gépkezelő","Fizikai",8322,{"$f":"--ISNUMBER(SEARCH(Adatlap!$C$32,FEOR!A50))","v":1},{"$f":"IF(D50=1,SUMIF($D$2:D50,1),\"\")","v":49},"Vízgazdálkodási gépkezelő"]
["Energetikai gép kezelője","Fizikai",8321,{"$f":"--ISNUMBER(SEARCH(Adatlap!$C$32,FEOR!A51))","v":1},{"$f":"IF(D51=1,SUMIF($D$2:D51,1),\"\")","v":50},"Energetikai gép kezelője"]
["Kútfúró, mélyfúró gép kezelője (kőolaj, földgáz, víz)","Fizikai",8312,{"$f":"--ISNUMBER(SEARCH(Adatlap!$C$32,FEOR!A52))","v":1},{"$f":"IF(D52=1,SUMIF($D$2:D52,1),\"\")","v":51},"Kútfúró, mélyfúró gép kezelője (kőolaj, földgáz, víz)"]
["Szilárdásvány-kitermelő gép kezelője (szén, kő)","Fizikai",8311,{"$f":"--ISNUMBER(SEARCH(Adatlap!$C$32,FEOR!A53))","v":1},{"$f":"IF(D53=1,SUMIF($D$2:D53,1),\"\")","v":52},"Szilárdásvány-kitermelő gép kezelője (szén, kő)"]
["Egyéb termék-összeszerelő","Fizikai",8219,{"$f":"--ISNUMBER(SEARCH(Adatlap!$C$32,FEOR!A54))","v":1},{"$f":"IF(D54=1,SUMIF($D$2:D54,1),\"\")","v":53},"Egyéb termék-összeszerelő"]
["Villamosberendezés-összeszerelő","Fizikai",8212,{"$f":"--ISNUMBER(SEARCH(Adatlap!$C$32,FEOR!A55))","v":1},{"$f":"IF(D55=1,SUMIF($D$2:D55,1),\"\")","v":54},"Villamosberendezés-összeszerelő"]
["Mechanikaigép-összeszerelő","Fizikai",8211,{"$f":"--ISNUMBER(SEARCH(Adatlap!$C$32,FEOR!A56))","v":1},{"$f":"IF(D56=1,SUMIF($D$2:D56,1),\"\")","v":55},"Mechanikaigép-összeszerelő"]
["Egyéb, máshova nem sorolható feldolgozóipari gép kezelője","Fizikai",8190,{"$f":"--ISNUMBER(SEARCH(Adatlap!$C$32,FEOR!A57))","v":1},{"$f":"IF(D57=1,SUMIF($D$2:D57,1),\"\")","v":56},"Egyéb, máshova nem sorolható feldolgozóipari gép kezelője"]
["Fémmegmunkáló, felületkezelő gép kezelője","Fizikai",8152,{"$f":"--ISNUMBER(SEARCH(Adatlap!$C$32,FEOR!A58))","v":1},{"$f":"IF(D58=1,SUMIF($D$2:D58,1),\"\")","v":57},"Fémmegmunkáló, felületkezelő gép kezelője"]
["Fémfeldolgozó gép kezelője","Fizikai",8151,{"$f":"--ISNUMBER(SEARCH(Adatlap!$C$32,FEOR!A59))","v":1},{"$f":"IF(D59=1,SUMIF($D$2:D59,1),\"\")","v":58},"Fémfeldolgozó gép kezelője"]
["Papíripari alapanyagot gyártó gép kezelője","Fizikai",8144,{"$f":"--ISNUMBER(SEARCH(Adatlap!$C$32,FEOR!A60))","v":1},{"$f":"IF(D60=1,SUMIF($D$2:D60,1),\"\")","v":59},"Papíripari alapanyagot gyártó gép kezelője"]
["Cement-, kő- és egyéb ásványianyag-feldolgozó gép kezelője","Fizikai",8143,{"$f":"--ISNUMBER(SEARCH(Adatlap!$C$32,FEOR!A61))","v":1},{"$f":"IF(D61=1,SUMIF($D$2:D61,1),\"\")","v":60},"Cement-, kő- és egyéb ásványianyag-feldolgozó gép kezelője"]
["Üveget és üvegterméket gyártó gép kezelője","Fizikai",8142,{"$f":"--ISNUMBER(SEARCH(Adatlap!$C$32,FEOR!A62))","v":1},{"$f":"IF(D62=1,SUMIF($D$2:D62,1),\"\")","v":61},"Üveget és üvegterméket gyártó gép kezelője"]
["Kerámiaipari terméket gyártó gép kezelője","Fizikai",8141,{"$f":"--ISNUMBER(SEARCH(Adatlap!$C$32,FEOR!A63))","v":1},{"$f":"IF(D63=1,SUMIF($D$2:D63,1),\"\")","v":62},"Kerámiaipari terméket gyártó gép kezelője"]
["Fotó- és mozgófilmlaboráns","Fizikai",8137,{"$f":"--ISNUMBER(SEARCH(Adatlap!$C$32,FEOR!A64))","v":1},{"$f":"IF(D64=1,SUMIF($D$2:D64,1),\"\")","v":63},"Fotó- és mozgófilmlaboráns"]
["Gumitermékgyártó gép kezelője","Fizikai",8136,{"$f":"--ISNUMBER(SEARCH(Adatlap!$C$32,FEOR!A65))","v":1},{"$f":"IF(D65=1,SUMIF($D$2:D65,1),\"\")","v":64},"Gumitermékgyártó gép kezelője"]
["Műanyagtermék-gyártó gép kezelője","Fizikai",8135,{"$f":"--ISNUMBER(SEARCH(Adatlap!$C$32,FEOR!A66))","v":1},{"$f":"IF(D66=1,SUMIF($D$2:D66,1),\"\")","v":65},"Műanyagtermék-gyártó gép kezelője"]
["Műtrágya- és növényvédőszer-gyártó gép kezelője","Fizikai",8134,{"$f":"--ISNUMBER(SEARCH(Adatlap!$C$32,FEOR!A67))","v":1},{"$f":"IF(D67=1,SUMIF($D$2:D67,1),\"\")","v":66},{"$f":"IFERROR(INDEX($A$2:$A$486,MATCH(ROW(F66),$E$2:$E$486,0)),\"\")","v":"Műtrágya- és növényvédőszer-gyártó gép kezelője"}]
["Gyógyszergyártó gép kezelője","Fizikai",8133,{"$f":"--ISNUMBER(SEARCH(Adatlap!$C$32,FEOR!A68))","v":1},{"$f":"IF(D68=1,SUMIF($D$2:D68,1),\"\")","v":67},"Gyógyszergyártó gép kezelője"]
["Vegyi alapanyagot és terméket gyártó gép kezelője","Fizikai",8132,{"$f":"--ISNUMBER(SEARCH(Adatlap!$C$32,FEOR!A69))","v":1},{"$f":"IF(D69=1,SUMIF($D$2:D69,1),\"\")","v":68},"Vegyi alapanyagot és terméket gyártó gép kezelője"]
["Kőolaj- és földgázfeldolgozó gép kezelője","Fizikai",8131,{"$f":"--ISNUMBER(SEARCH(Adatlap!$C$32,FEOR!A70))","v":1},{"$f":"IF(D70=1,SUMIF($D$2:D70,1),\"\")","v":69},"Kőolaj- és földgázfeldolgozó gép kezelője"]
["Papír- és cellulóztermék-gyártó gép kezelője és gyártósor mellett dolgozó","Fizikai",8126,{"$f":"--ISNUMBER(SEARCH(Adatlap!$C$32,FEOR!A71))","v":1},{"$f":"IF(D71=1,SUMIF($D$2:D71,1),\"\")","v":70},"Papír- és cellulóztermék-gyártó gép kezelője és gyártósor mellett dolgozó"]
["Fafeldolgozó gép kezelője és gyártósor mellett dolgozó","Fizikai",8125,{"$f":"--ISNUMBER(SEARCH(Adatlap!$C$32,FEOR!A72))","v":1},{"$f":"IF(D72=1,SUMIF($D$2:D72,1),\"\")","v":71},"Fafeldolgozó gép kezelője és gyártósor mellett dolgozó"]
["Cipőgyártó gép kezelője és gyártósor mellett dolgozó","Fizikai",8124,{"$f":"--ISNUMBER(SEARCH(Adatlap!$C$32,FEOR!A73))","v":1},{"$f":"IF(D73=1,SUMIF($D$2:D73,1),\"\")","v":72},"Cipőgyártó gép kezelője és gyártósor mellett dolgozó"]
["Bőrkikészítő- és -feldolgozó gépkezelő és gyártósor mellett dolgozó","Fizikai",8123,{"$f":"--ISNUMBER(SEARCH(Adatlap!$C$32,FEOR!A74))","v":1},{"$f":"IF(D74=1,SUMIF($D$2:D74,1),\"\")","v":73},"Bőrkikészítő- és -feldolgozó gépkezelő és gyártósor mellett dolgozó"]
["Ruházati gép kezelője és gyártósor mellett dolgozó","Fizikai",8122,{"$f":"--ISNUMBER(SEARCH(Adatlap!$C$32,FEOR!A75))","v":1},{"$f":"IF(D75=1,SUMIF($D$2:D75,1),\"\")","v":74},"Ruházati gép kezelője és gyártósor mellett dolgozó"]
["Textilipari gép kezelője és gyártósor mellett dolgozó ","Fizikai",8121,{"$f":"--ISNUMBER(SEARCH(Adatlap!$C$32,FEOR!A76))","v":1},{"$f":"IF(D76=1,SUMIF($D$2:D76,1),\"\")","v":75},"Textilipari gép kezelője és gyártósor mellett dolgozó "]
["Dohánygyártó gép kezelője","Fizikai",8112,{"$f":"--ISNUMBER(SEARCH(Adatlap!$C$32,FEOR!A77))","v":1},{"$f":"IF(D77=1,SUMIF($D$2:D77,1),\"\")","v":76},"Dohánygyártó gép kezelője"]
["Élelmiszer-, italgyártó gép kezelője","Fizikai",8111,{"$f":"--ISNUMBER(SEARCH(Adatlap!$C$32,FEOR!A78))","v":1},{"$f":"IF(D78=1,SUMIF($D$2:D78,1),\"\")","v":77},"Élelmiszer-, italgyártó gép kezelője"]
["Egyéb, máshova nem sorolható ipari és építőipari foglalkozású","Fizikai",7919,{"$f":"--ISNUMBER(SEARCH(Adatlap!$C$32,FEOR!A79))","v":1},{"$f":"IF(D79=1,SUMIF($D$2:D79,1),\"\")","v":78},"Egyéb, máshova nem sorolható ipari és építőipari foglalkozású"]
["Kéményseprő, épületszerkezet-tisztító","Fizikai",7915,{"$f":"--ISNUMBER(SEARCH(Adatlap!$C$32,FEOR!A80))","v":1},{"$f":"IF(D80=1,SUMIF($D$2:D80,1),\"\")","v":79},"Kéményseprő, épületszerkezet-tisztító"]
["Kártevőirtó, gyomírtó","Fizikai",7914,{"$f":"--ISNUMBER(SEARCH(Adatlap!$C$32,FEOR!A81))","v":1},{"$f":"IF(D81=1,SUMIF($D$2:D81,1),\"\")","v":80},"Kártevőirtó, gyomírtó"]
["Robbantómester","Fizikai",7913,{"$f":"--ISNUMBER(SEARCH(Adatlap!$C$32,FEOR!A82))","v":1},{"$f":"IF(D82=1,SUMIF($D$2:D82,1),\"\")","v":81},"Robbantómester"]
["Ipari alpinista","Fizikai",7912,{"$f":"--ISNUMBER(SEARCH(Adatlap!$C$32,FEOR!A83))","v":1},{"$f":"IF(D83=1,SUMIF($D$2:D83,1),\"\")","v":82},"Ipari alpinista"]
["Ipari búvár","Fizikai",7911,{"$f":"--ISNUMBER(SEARCH(Adatlap!$C$32,FEOR!A84))","v":1},{"$f":"IF(D84=1,SUMIF($D$2:D84,1),\"\")","v":83},"Ipari búvár"]
["Egyéb építési szakipari foglalkozású","Fizikai",7539,{"$f":"--ISNUMBER(SEARCH(Adatlap!$C$32,FEOR!A85))","v":1},{"$f":"IF(D85=1,SUMIF($D$2:D85,1),\"\")","v":84},"Egyéb építési szakipari foglalkozású"]
["Üvegező","Fizikai",7538,{"$f":"--ISNUMBER(SEARCH(Adatlap!$C$32,FEOR!A86))","v":1},{"$f":"IF(D86=1,SUMIF($D$2:D86,1),\"\")","v":85},"Üvegező"]
["Kályha- és kandallóépítő","Fizikai",7537,{"$f":"--ISNUMBER(SEARCH(Adatlap!$C$32,FEOR!A87))","v":1},{"$f":"IF(D87=1,SUMIF($D$2:D87,1),\"\")","v":86},"Kályha- és kandallóépítő"]
["Kőfaragó, műköves","Fizikai",7536,{"$f":"--ISNUMBER(SEARCH(Adatlap!$C$32,FEOR!A88))","v":1},{"$f":"IF(D88=1,SUMIF($D$2:D88,1),\"\")","v":87},"Kőfaragó, műköves"]
["Festő és mázoló","Fizikai",7535,{"$f":"--ISNUMBER(SEARCH(Adatlap!$C$32,FEOR!A89))","v":1},{"$f":"IF(D89=1,SUMIF($D$2:D89,1),\"\")","v":88},"Festő és mázoló"]
["Burkoló","Fizikai",7534,{"$f":"--ISNUMBER(SEARCH(Adatlap!$C$32,FEOR!A90))","v":1},{"$f":"IF(D90=1,SUMIF($D$2:D90,1),\"\")","v":89},"Burkoló"]
["Épület-, építménybádogos","Fizikai",7533,{"$f":"--ISNUMBER(SEARCH(Adatlap!$C$32,FEOR!A91))","v":1},{"$f":"IF(D91=1,SUMIF($D$2:D91,1),\"\")","v":90},"Épület-, építménybádogos"]
["Tetőfedő","Fizikai",7532,{"$f":"--ISNUMBER(SEARCH(Adatlap!$C$32,FEOR!A92))","v":1},{"$f":"IF(D92=1,SUMIF($D$2:D92,1),\"\")","v":91},"Tetőfedő"]
["Szigetelő","Fizikai",7531,{"$f":"--ISNUMBER(SEARCH(Adatlap!$C$32,FEOR!A93))","v":1},{"$f":"IF(D93=1,SUMIF($D$2:D93,1),\"\")","v":92},"Szigetelő"]
["Egyéb építési, szerelési foglalkozású","Fizikai",7529,{"$f":"--ISNUMBER(SEARCH(Adatlap!$C$32,FEOR!A94))","v":1},{"$f":"IF(D94=1,SUMIF($D$2:D94,1),\"\")","v":93},"Egyéb építési, szerelési foglalkozású"]
["Épületvillamossági szerelő, villanyszerelő","Fizikai",7524,{"$f":"--ISNUMBER(SEARCH(Adatlap!$C$32,FEOR!A95))","v":1},{"$f":"IF(D95=1,SUMIF($D$2:D95,1),\"\")","v":94},"Épületvillamossági szerelő, villanyszerelő"]
["Felvonószerelő","Fizikai",7523,{"$f":"--ISNUMBER(SEARCH(Adatlap!$C$32,FEOR!A96))","v":1},{"$f":"IF(D96=1,SUMIF($D$2:D96,1),\"\")","v":95},"Felvonószerelő"]
["Szellőző-, hűtő- és klimatizálóberendezés-szerelő","Fizikai",7522,{"$f":"--ISNUMBER(SEARCH(Adatlap!$C$32,FEOR!A97))","v":1},{"$f":"IF(D97=1,SUMIF($D$2:D97,1),\"\")","v":96},"Szellőző-, hűtő- és klimatizálóberendezés-szerelő"]
["Vezeték- és csőhálózat-szerelő (víz, gáz, fűtés)","Fizikai",7521,{"$f":"--ISNUMBER(SEARCH(Adatlap!$C$32,FEOR!A98))","v":1},{"$f":"IF(D98=1,SUMIF($D$2:D98,1),\"\")","v":97},"Vezeték- és csőhálózat-szerelő (víz, gáz, fűtés)"]
["Egyéb építőmesteri foglalkozású","Fizikai",7519,{"$f":"--ISNUMBER(SEARCH(Adatlap!$C$32,FEOR!A99))","v":1},{"$f":"IF(D99=1,SUMIF($D$2:D99,1),\"\")","v":98},"Egyéb építőmesteri foglalkozású"]
["Építményszerkezet-szerelő","Fizikai",7515,{"$f":"--ISNUMBER(SEARCH(Adatlap!$C$32,FEOR!A100))","v":1},{"$f":"IF(D100=1,SUMIF($D$2:D100,1),\"\")","v":99},"Építményszerkezet-szerelő"]
["Épületasztalos","Fizikai",7514,{"$f":"--ISNUMBER(SEARCH(Adatlap!$C$32,FEOR!A101))","v":1},{"$f":"IF(D101=1,SUMIF($D$2:D101,1),\"\")","v":100},"Épületasztalos"]
["Ács","Fizikai",7513,{"$f":"--ISNUMBER(SEARCH(Adatlap!$C$32,FEOR!A102))","v":1},{"$f":"IF(D102=1,SUMIF($D$2:D102,1),\"\")","v":101},"Ács"]
["Gipszkartonozó, stukkózó","Fizikai",7512,{"$f":"--ISNUMBER(SEARCH(Adatlap!$C$32,FEOR!A103))","v":1},{"$f":"IF(D103=1,SUMIF($D$2:D103,1),\"\")","v":102},"Gipszkartonozó, stukkózó"]
["Kőműves","Fizikai",7511,{"$f":"--ISNUMBER(SEARCH(Adatlap!$C$32,FEOR!A104))","v":1},{"$f":"IF(D104=1,SUMIF($D$2:D104,1),\"\")","v":103},"Kőműves"]
["Finommechanikai műszerész","Fizikai",7420,{"$f":"--ISNUMBER(SEARCH(Adatlap!$C$32,FEOR!A105))","v":1},{"$f":"IF(D105=1,SUMIF($D$2:D105,1),\"\")","v":104},"Finommechanikai műszerész"]
["Egyéb kézműipari foglalkozású","Fizikai",7419,{"$f":"--ISNUMBER(SEARCH(Adatlap!$C$32,FEOR!A106))","v":1},{"$f":"IF(D106=1,SUMIF($D$2:D106,1),\"\")","v":105},"Egyéb kézműipari foglalkozású"]
["Textilműves, hímző, csipkeverő","Fizikai",7418,{"$f":"--ISNUMBER(SEARCH(Adatlap!$C$32,FEOR!A107))","v":1},{"$f":"IF(D107=1,SUMIF($D$2:D107,1),\"\")","v":106},"Textilműves, hímző, csipkeverő"]
["Nád- és fűzfeldolgozó, seprű-, kefegyártó","Fizikai",7417,{"$f":"--ISNUMBER(SEARCH(Adatlap!$C$32,FEOR!A108))","v":1},{"$f":"IF(D108=1,SUMIF($D$2:D108,1),\"\")","v":107},"Nád- és fűzfeldolgozó, seprű-, kefegyártó"]
["Szőr- és tollfeldolgozó","Fizikai",7416,{"$f":"--ISNUMBER(SEARCH(Adatlap!$C$32,FEOR!A109))","v":1},{"$f":"IF(D109=1,SUMIF($D$2:D109,1),\"\")","v":108},"Szőr- és tollfeldolgozó"]
["Hangszerkészítő","Fizikai",7415,{"$f":"--ISNUMBER(SEARCH(Adatlap!$C$32,FEOR!A110))","v":1},{"$f":"IF(D110=1,SUMIF($D$2:D110,1),\"\")","v":109},"Hangszerkészítő"]
["Üveggyártó","Fizikai",7414,{"$f":"--ISNUMBER(SEARCH(Adatlap!$C$32,FEOR!A111))","v":1},{"$f":"IF(D111=1,SUMIF($D$2:D111,1),\"\")","v":110},"Üveggyártó"]
["Keramikus","Fizikai",7413,{"$f":"--ISNUMBER(SEARCH(Adatlap!$C$32,FEOR!A112))","v":1},{"$f":"IF(D112=1,SUMIF($D$2:D112,1),\"\")","v":111},"Keramikus"]
["Ékszerkészítő, ötvös, drágakőcsiszoló","Fizikai",7412,{"$f":"--ISNUMBER(SEARCH(Adatlap!$C$32,FEOR!A113))","v":1},{"$f":"IF(D113=1,SUMIF($D$2:D113,1),\"\")","v":112},"Ékszerkészítő, ötvös, drágakőcsiszoló"]
["Címfestő","Fizikai",7411,{"$f":"--ISNUMBER(SEARCH(Adatlap!$C$32,FEOR!A114))","v":1},{"$f":"IF(D114=1,SUMIF($D$2:D114,1),\"\")","v":113},"Címfestő"]
["Elektromoshálózat-szerelő, -javító ","Fizikai",7343,{"$f":"--ISNUMBER(SEARCH(Adatlap!$C$32,FEOR!A115))","v":1},{"$f":"IF(D115=1,SUMIF($D$2:D115,1),\"\")","v":114},"Elektromoshálózat-szerelő, -javító "]
["Informatikai és telekommunikációs berendezések műszerésze, javítója","Fizikai",7342,{"$f":"--ISNUMBER(SEARCH(Adatlap!$C$32,FEOR!A116))","v":1},{"$f":"IF(D116=1,SUMIF($D$2:D116,1),\"\")","v":115},"Informatikai és telekommunikációs berendezések műszerésze, javítója"]
["Villamos gépek és készülékek műszerésze, javítója","Fizikai",7341,{"$f":"--ISNUMBER(SEARCH(Adatlap!$C$32,FEOR!A117))","v":1},{"$f":"IF(D117=1,SUMIF($D$2:D117,1),\"\")","v":116},"Villamos gépek és készülékek műszerésze, javítója"]
["Kerékpár-karbantartó, -javító","Fizikai",7335,{"$f":"--ISNUMBER(SEARCH(Adatlap!$C$32,FEOR!A118))","v":1},{"$f":"IF(D118=1,SUMIF($D$2:D118,1),\"\")","v":117},"Kerékpár-karbantartó, -javító"]
["Mechanikaigép-karbantartó, -javító (műszerész)","Fizikai",7334,{"$f":"--ISNUMBER(SEARCH(Adatlap!$C$32,FEOR!A119))","v":1},{"$f":"IF(D119=1,SUMIF($D$2:D119,1),\"\")","v":118},"Mechanikaigép-karbantartó, -javító (műszerész)"]
["Mezőgazdasági és ipari gép (motor) karbantartója, javítója","Fizikai",7333,{"$f":"--ISNUMBER(SEARCH(Adatlap!$C$32,FEOR!A120))","v":1},{"$f":"IF(D120=1,SUMIF($D$2:D120,1),\"\")","v":119},"Mezőgazdasági és ipari gép (motor) karbantartója, javítója"]
["Repülőgépmotor-karbantartó, -javító","Fizikai",7332,{"$f":"--ISNUMBER(SEARCH(Adatlap!$C$32,FEOR!A121))","v":1},{"$f":"IF(D121=1,SUMIF($D$2:D121,1),\"\")","v":120},"Repülőgépmotor-karbantartó, -javító"]
["Gépjármű- és motorkarbantartó, -javító","Fizikai",7331,{"$f":"--ISNUMBER(SEARCH(Adatlap!$C$32,FEOR!A122))","v":1},{"$f":"IF(D122=1,SUMIF($D$2:D122,1),\"\")","v":121},"Gépjármű- és motorkarbantartó, -javító"]
["Fém- és egyéb tartószerkezet-szerelő","Fizikai",7328,{"$f":"--ISNUMBER(SEARCH(Adatlap!$C$32,FEOR!A123))","v":1},{"$f":"IF(D123=1,SUMIF($D$2:D123,1),\"\")","v":122},"Fém- és egyéb tartószerkezet-szerelő"]
["Festékszóró, fényező","Fizikai",7327,{"$f":"--ISNUMBER(SEARCH(Adatlap!$C$32,FEOR!A124))","v":1},{"$f":"IF(D124=1,SUMIF($D$2:D124,1),\"\")","v":123},"Festékszóró, fényező"]
["Kovács","Fizikai",7326,{"$f":"--ISNUMBER(SEARCH(Adatlap!$C$32,FEOR!A125))","v":1},{"$f":"IF(D125=1,SUMIF($D$2:D125,1),\"\")","v":124},"Kovács"]
["Hegesztő, lángvágó","Fizikai",7325,{"$f":"--ISNUMBER(SEARCH(Adatlap!$C$32,FEOR!A126))","v":1},{"$f":"IF(D126=1,SUMIF($D$2:D126,1),\"\")","v":125},"Hegesztő, lángvágó"]
["Fémcsiszoló, köszörűs, szerszámköszörűs","Fizikai",7324,{"$f":"--ISNUMBER(SEARCH(Adatlap!$C$32,FEOR!A127))","v":1},{"$f":"IF(D127=1,SUMIF($D$2:D127,1),\"\")","v":126},"Fémcsiszoló, köszörűs, szerszámköszörűs"]
["Forgácsoló","Fizikai",7323,{"$f":"--ISNUMBER(SEARCH(Adatlap!$C$32,FEOR!A128))","v":1},{"$f":"IF(D128=1,SUMIF($D$2:D128,1),\"\")","v":127},"Forgácsoló"]
["Szerszámkészítő","Fizikai",7322,{"$f":"--ISNUMBER(SEARCH(Adatlap!$C$32,FEOR!A129))","v":1},{"$f":"IF(D129=1,SUMIF($D$2:D129,1),\"\")","v":128},"Szerszámkészítő"]
["Lakatos","Fizikai",7321,{"$f":"--ISNUMBER(SEARCH(Adatlap!$C$32,FEOR!A130))","v":1},{"$f":"IF(D130=1,SUMIF($D$2:D130,1),\"\")","v":129},"Lakatos"]
["Fémöntőminta-készítő","Fizikai",7310,{"$f":"--ISNUMBER(SEARCH(Adatlap!$C$32,FEOR!A131))","v":1},{"$f":"IF(D131=1,SUMIF($D$2:D131,1),\"\")","v":130},{"$f":"IFERROR(INDEX($A$2:$A$486,MATCH(ROW(F130),$E$2:$E$486,0)),\"\")","v":"Fémöntőminta-készítő"}]
["Könyvkötő","Fizikai",7233,{"$f":"--ISNUMBER(SEARCH(Adatlap!$C$32,FEOR!A132))","v":1},{"$f":"IF(D132=1,SUMIF($D$2:D132,1),\"\")","v":131},"Könyvkötő"]
["Nyomdász, nyomdai gépmester","Fizikai",7232,{"$f":"--ISNUMBER(SEARCH(Adatlap!$C$32,FEOR!A133))","v":1},{"$f":"IF(D133=1,SUMIF($D$2:D133,1),\"\")","v":132},"Nyomdász, nyomdai gépmester"]
["Nyomdai előkészítő","Fizikai",7231,{"$f":"--ISNUMBER(SEARCH(Adatlap!$C$32,FEOR!A134))","v":1},{"$f":"IF(D134=1,SUMIF($D$2:D134,1),\"\")","v":133},"Nyomdai előkészítő"]
["Kádár, bognár","Fizikai",7225,{"$f":"--ISNUMBER(SEARCH(Adatlap!$C$32,FEOR!A135))","v":1},{"$f":"IF(D135=1,SUMIF($D$2:D135,1),\"\")","v":134},"Kádár, bognár"]
["Kárpitos","Fizikai",7224,{"$f":"--ISNUMBER(SEARCH(Adatlap!$C$32,FEOR!A136))","v":1},{"$f":"IF(D136=1,SUMIF($D$2:D136,1),\"\")","v":135},"Kárpitos"]
["Bútorasztalos","Fizikai",7223,{"$f":"--ISNUMBER(SEARCH(Adatlap!$C$32,FEOR!A137))","v":1},{"$f":"IF(D137=1,SUMIF($D$2:D137,1),\"\")","v":136},"Bútorasztalos"]
["Faesztergályos","Fizikai",7222,{"$f":"--ISNUMBER(SEARCH(Adatlap!$C$32,FEOR!A138))","v":1},{"$f":"IF(D138=1,SUMIF($D$2:D138,1),\"\")","v":137},"Faesztergályos"]
["Famegmunkáló","Fizikai",7221,{"$f":"--ISNUMBER(SEARCH(Adatlap!$C$32,FEOR!A139))","v":1},{"$f":"IF(D139=1,SUMIF($D$2:D139,1),\"\")","v":138},"Famegmunkáló"]
["Cipész, cipőkészítő, -javító","Fizikai",7217,{"$f":"--ISNUMBER(SEARCH(Adatlap!$C$32,FEOR!A140))","v":1},{"$f":"IF(D140=1,SUMIF($D$2:D140,1),\"\")","v":139},"Cipész, cipőkészítő, -javító"]
["Bőrdíszműves, bőröndös, bőrtermékkészítő, -javító","Fizikai",7216,{"$f":"--ISNUMBER(SEARCH(Adatlap!$C$32,FEOR!A141))","v":1},{"$f":"IF(D141=1,SUMIF($D$2:D141,1),\"\")","v":140},"Bőrdíszműves, bőröndös, bőrtermékkészítő, -javító"]
["Tímár","Fizikai",7215,{"$f":"--ISNUMBER(SEARCH(Adatlap!$C$32,FEOR!A142))","v":1},{"$f":"IF(D142=1,SUMIF($D$2:D142,1),\"\")","v":141},"Tímár"]
["Szűcs, szőrmefestő","Fizikai",7214,{"$f":"--ISNUMBER(SEARCH(Adatlap!$C$32,FEOR!A143))","v":1},{"$f":"IF(D143=1,SUMIF($D$2:D143,1),\"\")","v":142},"Szűcs, szőrmefestő"]
["Kalapos, kesztyűs","Fizikai",7213,{"$f":"--ISNUMBER(SEARCH(Adatlap!$C$32,FEOR!A144))","v":1},{"$f":"IF(D144=1,SUMIF($D$2:D144,1),\"\")","v":143},"Kalapos, kesztyűs"]
["Szabó, varró","Fizikai",7212,{"$f":"--ISNUMBER(SEARCH(Adatlap!$C$32,FEOR!A145))","v":1},{"$f":"IF(D145=1,SUMIF($D$2:D145,1),\"\")","v":144},"Szabó, varró"]
["Szabásminta-készítő","Fizikai",7211,{"$f":"--ISNUMBER(SEARCH(Adatlap!$C$32,FEOR!A146))","v":1},{"$f":"IF(D146=1,SUMIF($D$2:D146,1),\"\")","v":145},"Szabásminta-készítő"]
["Borász és egyéb szeszesital-gyártó, szikvízkészítő","Fizikai",7115,{"$f":"--ISNUMBER(SEARCH(Adatlap!$C$32,FEOR!A147))","v":1},{"$f":"IF(D147=1,SUMIF($D$2:D147,1),\"\")","v":146},"Borász és egyéb szeszesital-gyártó, szikvízkészítő"]
["Pék, édesiparitermék-gyártó","Fizikai",7114,{"$f":"--ISNUMBER(SEARCH(Adatlap!$C$32,FEOR!A148))","v":1},{"$f":"IF(D148=1,SUMIF($D$2:D148,1),\"\")","v":147},"Pék, édesiparitermék-gyártó"]
["Tejfeldolgozó, tejtermékgyártó","Fizikai",7113,{"$f":"--ISNUMBER(SEARCH(Adatlap!$C$32,FEOR!A149))","v":1},{"$f":"IF(D149=1,SUMIF($D$2:D149,1),\"\")","v":148},"Tejfeldolgozó, tejtermékgyártó"]
["Gyümölcs- és zöldségfeldolgozó, -tartósító","Fizikai",7112,{"$f":"--ISNUMBER(SEARCH(Adatlap!$C$32,FEOR!A150))","v":1},{"$f":"IF(D150=1,SUMIF($D$2:D150,1),\"\")","v":149},"Gyümölcs- és zöldségfeldolgozó, -tartósító"]
["Húsfeldolgozó","Fizikai",7111,{"$f":"--ISNUMBER(SEARCH(Adatlap!$C$32,FEOR!A151))","v":1},{"$f":"IF(D151=1,SUMIF($D$2:D151,1),\"\")","v":150},"Húsfeldolgozó"]
["Halászati foglalkozású","Fizikai",6230,{"$f":"--ISNUMBER(SEARCH(Adatlap!$C$32,FEOR!A152))","v":1},{"$f":"IF(D152=1,SUMIF($D$2:D152,1),\"\")","v":151},"Halászati foglalkozású"]
["Vadgazdálkodási foglalkozású","Fizikai",6220,{"$f":"--ISNUMBER(SEARCH(Adatlap!$C$32,FEOR!A153))","v":1},{"$f":"IF(D153=1,SUMIF($D$2:D153,1),\"\")","v":152},"Vadgazdálkodási foglalkozású"]
["Fakitermelő (favágó)","Fizikai",6212,{"$f":"--ISNUMBER(SEARCH(Adatlap!$C$32,FEOR!A154))","v":1},{"$f":"IF(D154=1,SUMIF($D$2:D154,1),\"\")","v":153},"Fakitermelő (favágó)"]
["Erdészeti foglalkozású","Fizikai",6211,{"$f":"--ISNUMBER(SEARCH(Adatlap!$C$32,FEOR!A155))","v":1},{"$f":"IF(D155=1,SUMIF($D$2:D155,1),\"\")","v":154},"Erdészeti foglalkozású"]
["Vegyes profilú gazdálkodó","Fizikai",6130,{"$f":"--ISNUMBER(SEARCH(Adatlap!$C$32,FEOR!A156))","v":1},{"$f":"IF(D156=1,SUMIF($D$2:D156,1),\"\")","v":155},"Vegyes profilú gazdálkodó"]
["Kisállattartó és -tenyésztő","Fizikai",6124,{"$f":"--ISNUMBER(SEARCH(Adatlap!$C$32,FEOR!A157))","v":1},{"$f":"IF(D157=1,SUMIF($D$2:D157,1),\"\")","v":156},"Kisállattartó és -tenyésztő"]
["Méhész","Fizikai",6123,{"$f":"--ISNUMBER(SEARCH(Adatlap!$C$32,FEOR!A158))","v":1},{"$f":"IF(D158=1,SUMIF($D$2:D158,1),\"\")","v":157},"Méhész"]
["Baromfitartó és -tenyésztő","Fizikai",6122,{"$f":"--ISNUMBER(SEARCH(Adatlap!$C$32,FEOR!A159))","v":1},{"$f":"IF(D159=1,SUMIF($D$2:D159,1),\"\")","v":158},"Baromfitartó és -tenyésztő"]
["Szarvasmarha-, ló-, sertés-, juhtartó és -tenyésztő ","Fizikai",6121,{"$f":"--ISNUMBER(SEARCH(Adatlap!$C$32,FEOR!A160))","v":1},{"$f":"IF(D160=1,SUMIF($D$2:D160,1),\"\")","v":159},"Szarvasmarha-, ló-, sertés-, juhtartó és -tenyésztő "]
["Egyéb növénytermesztési foglalkozású","Fizikai",6119,{"$f":"--ISNUMBER(SEARCH(Adatlap!$C$32,FEOR!A161))","v":1},{"$f":"IF(D161=1,SUMIF($D$2:D161,1),\"\")","v":160},"Egyéb növénytermesztési foglalkozású"]
["Gyógynövénytermesztő","Fizikai",6116,{"$f":"--ISNUMBER(SEARCH(Adatlap!$C$32,FEOR!A162))","v":1},{"$f":"IF(D162=1,SUMIF($D$2:D162,1),\"\")","v":161},"Gyógynövénytermesztő"]
["Dísznövény-, virág- és faiskolai kertész, csemetenevelő","Fizikai",6115,{"$f":"--ISNUMBER(SEARCH(Adatlap!$C$32,FEOR!A163))","v":1},{"$f":"IF(D163=1,SUMIF($D$2:D163,1),\"\")","v":162},"Dísznövény-, virág- és faiskolai kertész, csemetenevelő"]
["Szőlő-, gyümölcstermesztő","Fizikai",6114,{"$f":"--ISNUMBER(SEARCH(Adatlap!$C$32,FEOR!A164))","v":1},{"$f":"IF(D164=1,SUMIF($D$2:D164,1),\"\")","v":163},"Szőlő-, gyümölcstermesztő"]
["Zöldségtermesztő","Fizikai",6113,{"$f":"--ISNUMBER(SEARCH(Adatlap!$C$32,FEOR!A165))","v":1},{"$f":"IF(D165=1,SUMIF($D$2:D165,1),\"\")","v":164},"Zöldségtermesztő"]
["Bionövény-termesztő","Fizikai",6112,{"$f":"--ISNUMBER(SEARCH(Adatlap!$C$32,FEOR!A166))","v":1},{"$f":"IF(D166=1,SUMIF($D$2:D166,1),\"\")","v":165},"Bionövény-termesztő"]
["Szántóföldinövény-termesztő","Fizikai",6111,{"$f":"--ISNUMBER(SEARCH(Adatlap!$C$32,FEOR!A167))","v":1},{"$f":"IF(D167=1,SUMIF($D$2:D167,1),\"\")","v":166},"Szántóföldinövény-termesztő"]
["Egyéb, máshova nem sorolható szolgáltatási foglalkozású","Fizikai",5299,{"$f":"--ISNUMBER(SEARCH(Adatlap!$C$32,FEOR!A168))","v":1},{"$f":"IF(D168=1,SUMIF($D$2:D168,1),\"\")","v":167},"Egyéb, máshova nem sorolható szolgáltatási foglalkozású"]
["Temetkezési foglalkozású","Fizikai",5293,{"$f":"--ISNUMBER(SEARCH(Adatlap!$C$32,FEOR!A169))","v":1},{"$f":"IF(D169=1,SUMIF($D$2:D169,1),\"\")","v":168},"Temetkezési foglalkozású"]
["Hobbiállat-gondozó, -kozmetikus","Fizikai",5292,{"$f":"--ISNUMBER(SEARCH(Adatlap!$C$32,FEOR!A170))","v":1},{"$f":"IF(D170=1,SUMIF($D$2:D170,1),\"\")","v":169},"Hobbiállat-gondozó, -kozmetikus"]
["Járművezető-oktató","Szellemi",5291,{"$f":"--ISNUMBER(SEARCH(Adatlap!$C$32,FEOR!A171))","v":1},{"$f":"IF(D171=1,SUMIF($D$2:D171,1),\"\")","v":170},"Járművezető-oktató"]
["Egyéb személy- és vagyonvédelmi foglalkozású","Fizikai",5259,{"$f":"--ISNUMBER(SEARCH(Adatlap!$C$32,FEOR!A172))","v":1},{"$f":"IF(D172=1,SUMIF($D$2:D172,1),\"\")","v":171},"Egyéb személy- és vagyonvédelmi foglalkozású"]
["Közterület-felügyelő","Fizikai",5256,{"$f":"--ISNUMBER(SEARCH(Adatlap!$C$32,FEOR!A173))","v":1},{"$f":"IF(D173=1,SUMIF($D$2:D173,1),\"\")","v":172},"Közterület-felügyelő"]
["Természetvédelmi őr","Fizikai",5255,{"$f":"--ISNUMBER(SEARCH(Adatlap!$C$32,FEOR!A174))","v":1},{"$f":"IF(D174=1,SUMIF($D$2:D174,1),\"\")","v":173},"Természetvédelmi őr"]
["Vagyonőr, testőr","Fizikai",5254,{"$f":"--ISNUMBER(SEARCH(Adatlap!$C$32,FEOR!A175))","v":1},{"$f":"IF(D175=1,SUMIF($D$2:D175,1),\"\")","v":174},"Vagyonőr, testőr"]
["Büntetés-végrehajtási őr","Fizikai",5253,{"$f":"--ISNUMBER(SEARCH(Adatlap!$C$32,FEOR!A176))","v":1},{"$f":"IF(D176=1,SUMIF($D$2:D176,1),\"\")","v":175},"Büntetés-végrehajtási őr"]
["Tűzoltó","Fizikai",5252,{"$f":"--ISNUMBER(SEARCH(Adatlap!$C$32,FEOR!A177))","v":1},{"$f":"IF(D177=1,SUMIF($D$2:D177,1),\"\")","v":176},"Tűzoltó"]
["Rendőr","Fizikai",5251,{"$f":"--ISNUMBER(SEARCH(Adatlap!$C$32,FEOR!A178))","v":1},{"$f":"IF(D178=1,SUMIF($D$2:D178,1),\"\")","v":177},"Rendőr"]
["Épületgondnok","Fizikai",5243,{"$f":"--ISNUMBER(SEARCH(Adatlap!$C$32,FEOR!A179))","v":1},{"$f":"IF(D179=1,SUMIF($D$2:D179,1),\"\")","v":178},"Épületgondnok"]
["Házvezető","Fizikai",5242,{"$f":"--ISNUMBER(SEARCH(Adatlap!$C$32,FEOR!A180))","v":1},{"$f":"IF(D180=1,SUMIF($D$2:D180,1),\"\")","v":179},"Házvezető"]
["Vezető takarító","Fizikai",5241,{"$f":"--ISNUMBER(SEARCH(Adatlap!$C$32,FEOR!A181))","v":1},{"$f":"IF(D181=1,SUMIF($D$2:D181,1),\"\")","v":180},"Vezető takarító"]
["Idegenvezető","Szellemi",5233,{"$f":"--ISNUMBER(SEARCH(Adatlap!$C$32,FEOR!A182))","v":1},{"$f":"IF(D182=1,SUMIF($D$2:D182,1),\"\")","v":181},"Idegenvezető"]
["Utaskísérő (repülőn, hajón)","Fizikai",5232,{"$f":"--ISNUMBER(SEARCH(Adatlap!$C$32,FEOR!A183))","v":1},{"$f":"IF(D183=1,SUMIF($D$2:D183,1),\"\")","v":182},"Utaskísérő (repülőn, hajón)"]
["Kalauz, menetjegyellenőr","Fizikai",5231,{"$f":"--ISNUMBER(SEARCH(Adatlap!$C$32,FEOR!A184))","v":1},{"$f":"IF(D184=1,SUMIF($D$2:D184,1),\"\")","v":183},"Kalauz, menetjegyellenőr"]
["Egyéb személygondozási foglalkozású","Fizikai",5229,{"$f":"--ISNUMBER(SEARCH(Adatlap!$C$32,FEOR!A185))","v":1},{"$f":"IF(D185=1,SUMIF($D$2:D185,1),\"\")","v":184},"Egyéb személygondozási foglalkozású"]
["Házi gondozó","Fizikai",5223,{"$f":"--ISNUMBER(SEARCH(Adatlap!$C$32,FEOR!A186))","v":1},{"$f":"IF(D186=1,SUMIF($D$2:D186,1),\"\")","v":185},"Házi gondozó"]
["Segédápoló, műtőssegéd","Fizikai",5222,{"$f":"--ISNUMBER(SEARCH(Adatlap!$C$32,FEOR!A187))","v":1},{"$f":"IF(D187=1,SUMIF($D$2:D187,1),\"\")","v":186},"Segédápoló, műtőssegéd"]
["Gyermekfelügyelő, dajka","Fizikai",5221,{"$f":"--ISNUMBER(SEARCH(Adatlap!$C$32,FEOR!A188))","v":1},{"$f":"IF(D188=1,SUMIF($D$2:D188,1),\"\")","v":187},"Gyermekfelügyelő, dajka"]
["Egyéb személyi szolgáltatási foglalkozású","Fizikai",5219,{"$f":"--ISNUMBER(SEARCH(Adatlap!$C$32,FEOR!A189))","v":1},{"$f":"IF(D189=1,SUMIF($D$2:D189,1),\"\")","v":188},"Egyéb személyi szolgáltatási foglalkozású"]
["Manikűrös, pedikűrös","Fizikai",5213,{"$f":"--ISNUMBER(SEARCH(Adatlap!$C$32,FEOR!A190))","v":1},{"$f":"IF(D190=1,SUMIF($D$2:D190,1),\"\")","v":189},"Manikűrös, pedikűrös"]
["Kozmetikus","Fizikai",5212,{"$f":"--ISNUMBER(SEARCH(Adatlap!$C$32,FEOR!A191))","v":1},{"$f":"IF(D191=1,SUMIF($D$2:D191,1),\"\")","v":190},"Kozmetikus"]
["Fodrász","Fizikai",5211,{"$f":"--ISNUMBER(SEARCH(Adatlap!$C$32,FEOR!A192))","v":1},{"$f":"IF(D192=1,SUMIF($D$2:D192,1),\"\")","v":191},"Fodrász"]
["Cukrász","Fizikai",5135,{"$f":"--ISNUMBER(SEARCH(Adatlap!$C$32,FEOR!A193))","v":1},{"$f":"IF(D193=1,SUMIF($D$2:D193,1),\"\")","v":192},"Cukrász"]
["Szakács","Fizikai",5134,{"$f":"--ISNUMBER(SEARCH(Adatlap!$C$32,FEOR!A194))","v":1},{"$f":"IF(D194=1,SUMIF($D$2:D194,1),\"\")","v":193},"Szakács"]
["Pultos","Fizikai",5133,{"$f":"--ISNUMBER(SEARCH(Adatlap!$C$32,FEOR!A195))","v":1},{"$f":"IF(D195=1,SUMIF($D$2:D195,1),\"\")","v":194},{"$f":"IFERROR(INDEX($A$2:$A$486,MATCH(ROW(F194),$E$2:$E$486,0)),\"\")","v":"Pultos"}]
["Pincér","Fizikai",5132,{"$f":"--ISNUMBER(SEARCH(Adatlap!$C$32,FEOR!A196))","v":1},{"$f":"IF(D196=1,SUMIF($D$2:D196,1),\"\")","v":195},"Pincér"]
["Vendéglős","Fizikai",5131,{"$f":"--ISNUMBER(SEARCH(Adatlap!$C$32,FEOR!A197))","v":1},{"$f":"IF(D197=1,SUMIF($D$2:D197,1),\"\")","v":196},"Vendéglős"]
["Egyéb, máshova nem sorolható kereskedelmi foglalkozású","Fizikai",5129,{"$f":"--ISNUMBER(SEARCH(Adatlap!$C$32,FEOR!A198))","v":1},{"$f":"IF(D198=1,SUMIF($D$2:D198,1),\"\")","v":197},"Egyéb, máshova nem sorolható kereskedelmi foglalkozású"]
["Telefonos (multimédiás) értékesítési ügynök","Fizikai",5123,{"$f":"--ISNUMBER(SEARCH(Adatlap!$C$32,FEOR!A199))","v":1},{"$f":"IF(D199=1,SUMIF($D$2:D199,1),\"\")","v":198},"Telefonos (multimédiás) értékesítési ügynök"]
["Áru- és divatbemutató","Fizikai",5122,{"$f":"--ISNUMBER(SEARCH(Adatlap!$C$32,FEOR!A200))","v":1},{"$f":"IF(D200=1,SUMIF($D$2:D200,1),\"\")","v":199},"Áru- és divatbemutató"]
["Üzemanyagtöltő állomás kezelője","Fizikai",5121,{"$f":"--ISNUMBER(SEARCH(Adatlap!$C$32,FEOR!A201))","v":1},{"$f":"IF(D201=1,SUMIF($D$2:D201,1),\"\")","v":200},"Üzemanyagtöltő állomás kezelője"]
["Bolti pénztáros, jegypénztáros","Szellemi",5117,{"$f":"--ISNUMBER(SEARCH(Adatlap!$C$32,FEOR!A202))","v":1},{"$f":"IF(D202=1,SUMIF($D$2:D202,1),\"\")","v":201},"Bolti pénztáros, jegypénztáros"]
["Piaci, utcai étel- és italárus","Fizikai",5116,{"$f":"--ISNUMBER(SEARCH(Adatlap!$C$32,FEOR!A203))","v":1},{"$f":"IF(D203=1,SUMIF($D$2:D203,1),\"\")","v":202},"Piaci, utcai étel- és italárus"]
["Piaci, utcai árus","Fizikai",5115,{"$f":"--ISNUMBER(SEARCH(Adatlap!$C$32,FEOR!A204))","v":1},{"$f":"IF(D204=1,SUMIF($D$2:D204,1),\"\")","v":203},"Piaci, utcai árus"]
["Kölcsönző","Fizikai",5114,{"$f":"--ISNUMBER(SEARCH(Adatlap!$C$32,FEOR!A205))","v":1},{"$f":"IF(D205=1,SUMIF($D$2:D205,1),\"\")","v":204},"Kölcsönző"]
["Bolti eladó","Fizikai",5113,{"$f":"--ISNUMBER(SEARCH(Adatlap!$C$32,FEOR!A206))","v":1},{"$f":"IF(D206=1,SUMIF($D$2:D206,1),\"\")","v":205},"Bolti eladó"]
["Vezető eladó","Szellemi",5112,{"$f":"--ISNUMBER(SEARCH(Adatlap!$C$32,FEOR!A207))","v":1},{"$f":"IF(D207=1,SUMIF($D$2:D207,1),\"\")","v":206},"Vezető eladó"]
["Kereskedő","Fizikai",5111,{"$f":"--ISNUMBER(SEARCH(Adatlap!$C$32,FEOR!A208))","v":1},{"$f":"IF(D208=1,SUMIF($D$2:D208,1),\"\")","v":207},"Kereskedő"]
["Egyéb ügyfélkapcsolati foglalkozású","Szellemi",4229,{"$f":"--ISNUMBER(SEARCH(Adatlap!$C$32,FEOR!A209))","v":1},{"$f":"IF(D209=1,SUMIF($D$2:D209,1),\"\")","v":208},"Egyéb ügyfélkapcsolati foglalkozású"]
["Postai ügyfélkapcsolati foglalkozású","Szellemi",4227,{"$f":"--ISNUMBER(SEARCH(Adatlap!$C$32,FEOR!A210))","v":1},{"$f":"IF(D210=1,SUMIF($D$2:D210,1),\"\")","v":209},"Postai ügyfélkapcsolati foglalkozású"]
["Lakossági kérdező, összeíró","Szellemi",4226,{"$f":"--ISNUMBER(SEARCH(Adatlap!$C$32,FEOR!A211))","v":1},{"$f":"IF(D211=1,SUMIF($D$2:D211,1),\"\")","v":210},"Lakossági kérdező, összeíró"]
["Ügyfélszolgálati központ tájékoztatója","Szellemi",4225,{"$f":"--ISNUMBER(SEARCH(Adatlap!$C$32,FEOR!A212))","v":1},{"$f":"IF(D212=1,SUMIF($D$2:D212,1),\"\")","v":211},"Ügyfélszolgálati központ tájékoztatója"]
["Ügyfél- (vevő)tájékoztató","Szellemi",4224,{"$f":"--ISNUMBER(SEARCH(Adatlap!$C$32,FEOR!A213))","v":1},{"$f":"IF(D213=1,SUMIF($D$2:D213,1),\"\")","v":212},"Ügyfél- (vevő)tájékoztató"]
["Szállodai recepciós","Szellemi",4223,{"$f":"--ISNUMBER(SEARCH(Adatlap!$C$32,FEOR!A214))","v":1},{"$f":"IF(D214=1,SUMIF($D$2:D214,1),\"\")","v":213},"Szállodai recepciós"]
["Recepciós","Szellemi",4222,{"$f":"--ISNUMBER(SEARCH(Adatlap!$C$32,FEOR!A215))","v":1},{"$f":"IF(D215=1,SUMIF($D$2:D215,1),\"\")","v":214},"Recepciós"]
["Utazásszervező, tanácsadó","Szellemi",4221,{"$f":"--ISNUMBER(SEARCH(Adatlap!$C$32,FEOR!A216))","v":1},{"$f":"IF(D216=1,SUMIF($D$2:D216,1),\"\")","v":215},"Utazásszervező, tanácsadó"]
["Zálogházi ügyintéző és pénzkölcsönző","Szellemi",4213,{"$f":"--ISNUMBER(SEARCH(Adatlap!$C$32,FEOR!A217))","v":1},{"$f":"IF(D217=1,SUMIF($D$2:D217,1),\"\")","v":216},"Zálogházi ügyintéző és pénzkölcsönző"]
["Szerencsejáték-szervező","Fizikai",4212,{"$f":"--ISNUMBER(SEARCH(Adatlap!$C$32,FEOR!A218))","v":1},{"$f":"IF(D218=1,SUMIF($D$2:D218,1),\"\")","v":217},"Szerencsejáték-szervező"]
["Banki pénztáros","Szellemi",4211,{"$f":"--ISNUMBER(SEARCH(Adatlap!$C$32,FEOR!A219))","v":1},{"$f":"IF(D219=1,SUMIF($D$2:D219,1),\"\")","v":218},"Banki pénztáros"]
["Egyéb, máshova nem sorolható irodai, ügyviteli foglalkozású","Szellemi",4190,{"$f":"--ISNUMBER(SEARCH(Adatlap!$C$32,FEOR!A220))","v":1},{"$f":"IF(D220=1,SUMIF($D$2:D220,1),\"\")","v":219},"Egyéb, máshova nem sorolható irodai, ügyviteli foglalkozású"]
["Iratkezelő, irattáros","Szellemi",4136,{"$f":"--ISNUMBER(SEARCH(Adatlap!$C$32,FEOR!A221))","v":1},{"$f":"IF(D221=1,SUMIF($D$2:D221,1),\"\")","v":220},"Iratkezelő, irattáros"]
["Postai szolgáltató (kézbesítő, válogató)","Fizikai",4135,{"$f":"--ISNUMBER(SEARCH(Adatlap!$C$32,FEOR!A222))","v":1},{"$f":"IF(D222=1,SUMIF($D$2:D222,1),\"\")","v":221},"Postai szolgáltató (kézbesítő, válogató)"]
["Humánpolitikai adminisztrátor","Szellemi",4134,{"$f":"--ISNUMBER(SEARCH(Adatlap!$C$32,FEOR!A223))","v":1},{"$f":"IF(D223=1,SUMIF($D$2:D223,1),\"\")","v":222},"Humánpolitikai adminisztrátor"]
["Könyvtári, levéltári nyilvántartó","Szellemi",4133,{"$f":"--ISNUMBER(SEARCH(Adatlap!$C$32,FEOR!A224))","v":1},{"$f":"IF(D224=1,SUMIF($D$2:D224,1),\"\")","v":223},"Könyvtári, levéltári nyilvántartó"]
["Szállítási, szállítmányozási nyilvántartó","Szellemi",4132,{"$f":"--ISNUMBER(SEARCH(Adatlap!$C$32,FEOR!A225))","v":1},{"$f":"IF(D225=1,SUMIF($D$2:D225,1),\"\")","v":224},"Szállítási, szállítmányozási nyilvántartó"]
["Készlet- és anyagnyilvántartó","Szellemi",4131,{"$f":"--ISNUMBER(SEARCH(Adatlap!$C$32,FEOR!A226))","v":1},{"$f":"IF(D226=1,SUMIF($D$2:D226,1),\"\")","v":225},"Készlet- és anyagnyilvántartó"]
["Egyéb számviteli foglalkozású","Szellemi",4129,{"$f":"--ISNUMBER(SEARCH(Adatlap!$C$32,FEOR!A227))","v":1},{"$f":"IF(D227=1,SUMIF($D$2:D227,1),\"\")","v":226},"Egyéb számviteli foglalkozású"]
["Pénzügyi, statisztikai, biztosítási adminisztrátor ","Szellemi",4123,{"$f":"--ISNUMBER(SEARCH(Adatlap!$C$32,FEOR!A228))","v":1},{"$f":"IF(D228=1,SUMIF($D$2:D228,1),\"\")","v":227},"Pénzügyi, statisztikai, biztosítási adminisztrátor "]
["Bérelszámoló","Szellemi",4122,{"$f":"--ISNUMBER(SEARCH(Adatlap!$C$32,FEOR!A229))","v":1},{"$f":"IF(D229=1,SUMIF($D$2:D229,1),\"\")","v":228},"Bérelszámoló"]
["Könyvelő (analitikus)","Szellemi",4121,{"$f":"--ISNUMBER(SEARCH(Adatlap!$C$32,FEOR!A230))","v":1},{"$f":"IF(D230=1,SUMIF($D$2:D230,1),\"\")","v":229},"Könyvelő (analitikus)"]
["Adatrögzítő, kódoló","Szellemi",4114,{"$f":"--ISNUMBER(SEARCH(Adatlap!$C$32,FEOR!A231))","v":1},{"$f":"IF(D231=1,SUMIF($D$2:D231,1),\"\")","v":230},"Adatrögzítő, kódoló"]
["Gépíró, szövegszerkesztő","Szellemi",4113,{"$f":"--ISNUMBER(SEARCH(Adatlap!$C$32,FEOR!A232))","v":1},{"$f":"IF(D232=1,SUMIF($D$2:D232,1),\"\")","v":231},"Gépíró, szövegszerkesztő"]
["Általános irodai adminisztrátor","Szellemi",4112,{"$f":"--ISNUMBER(SEARCH(Adatlap!$C$32,FEOR!A233))","v":1},{"$f":"IF(D233=1,SUMIF($D$2:D233,1),\"\")","v":232},"Általános irodai adminisztrátor"]
["Titkár(nő)","Szellemi",4111,{"$f":"--ISNUMBER(SEARCH(Adatlap!$C$32,FEOR!A234))","v":1},{"$f":"IF(D234=1,SUMIF($D$2:D234,1),\"\")","v":233},"Titkár(nő)"]
["Egyéb ügyintéző","Szellemi",3910,{"$f":"--ISNUMBER(SEARCH(Adatlap!$C$32,FEOR!A235))","v":1},{"$f":"IF(D235=1,SUMIF($D$2:D235,1),\"\")","v":234},"Egyéb ügyintéző"]
["Egyéb vallási foglalkozású","Szellemi",3730,{"$f":"--ISNUMBER(SEARCH(Adatlap!$C$32,FEOR!A236))","v":1},{"$f":"IF(D236=1,SUMIF($D$2:D236,1),\"\")","v":235},"Egyéb vallási foglalkozású"]
["Fitnesz- és rekreációs program irányítója","Fizikai",3722,{"$f":"--ISNUMBER(SEARCH(Adatlap!$C$32,FEOR!A237))","v":1},{"$f":"IF(D237=1,SUMIF($D$2:D237,1),\"\")","v":236},"Fitnesz- és rekreációs program irányítója"]
["Sportoló","Szellemi",3721,{"$f":"--ISNUMBER(SEARCH(Adatlap!$C$32,FEOR!A238))","v":1},{"$f":"IF(D238=1,SUMIF($D$2:D238,1),\"\")","v":237},"Sportoló"]
["Egyéb művészeti és kulturális foglalkozású","Szellemi",3719,{"$f":"--ISNUMBER(SEARCH(Adatlap!$C$32,FEOR!A239))","v":1},{"$f":"IF(D239=1,SUMIF($D$2:D239,1),\"\")","v":238},"Egyéb művészeti és kulturális foglalkozású"]
["Kulturálisintézményi szaktechnikus","Szellemi",3717,{"$f":"--ISNUMBER(SEARCH(Adatlap!$C$32,FEOR!A240))","v":1},{"$f":"IF(D240=1,SUMIF($D$2:D240,1),\"\")","v":239},"Kulturálisintézményi szaktechnikus"]
["Lakberendező, dekoratőr","Szellemi",3716,{"$f":"--ISNUMBER(SEARCH(Adatlap!$C$32,FEOR!A241))","v":1},{"$f":"IF(D241=1,SUMIF($D$2:D241,1),\"\")","v":240},"Lakberendező, dekoratőr"]
["Kiegészítő filmgyártási és színházi foglalkozású","Fizikai",3715,{"$f":"--ISNUMBER(SEARCH(Adatlap!$C$32,FEOR!A242))","v":1},{"$f":"IF(D242=1,SUMIF($D$2:D242,1),\"\")","v":241},"Kiegészítő filmgyártási és színházi foglalkozású"]
["Díszletező, díszítő","Fizikai",3714,{"$f":"--ISNUMBER(SEARCH(Adatlap!$C$32,FEOR!A243))","v":1},{"$f":"IF(D243=1,SUMIF($D$2:D243,1),\"\")","v":242},"Díszletező, díszítő"]
["Fényképész","Fizikai",3713,{"$f":"--ISNUMBER(SEARCH(Adatlap!$C$32,FEOR!A244))","v":1},{"$f":"IF(D244=1,SUMIF($D$2:D244,1),\"\")","v":243},"Fényképész"]
["Segédrendező","Szellemi",3712,{"$f":"--ISNUMBER(SEARCH(Adatlap!$C$32,FEOR!A245))","v":1},{"$f":"IF(D245=1,SUMIF($D$2:D245,1),\"\")","v":244},"Segédrendező"]
["Segédszínész, statiszta","Szellemi",3711,{"$f":"--ISNUMBER(SEARCH(Adatlap!$C$32,FEOR!A246))","v":1},{"$f":"IF(D246=1,SUMIF($D$2:D246,1),\"\")","v":245},"Segédszínész, statiszta"]
["Egyéb hatósági ügyintéző","Szellemi",3659,{"$f":"--ISNUMBER(SEARCH(Adatlap!$C$32,FEOR!A247))","v":1},{"$f":"IF(D247=1,SUMIF($D$2:D247,1),\"\")","v":246},"Egyéb hatósági ügyintéző"]
["Végrehajtó, adósságbehajtó","Szellemi",3656,{"$f":"--ISNUMBER(SEARCH(Adatlap!$C$32,FEOR!A248))","v":1},{"$f":"IF(D248=1,SUMIF($D$2:D248,1),\"\")","v":247},"Végrehajtó, adósságbehajtó"]
["Nyomozó","Szellemi",3655,{"$f":"--ISNUMBER(SEARCH(Adatlap!$C$32,FEOR!A249))","v":1},{"$f":"IF(D249=1,SUMIF($D$2:D249,1),\"\")","v":248},"Nyomozó"]
["Hatósági engedélyek kiadásával foglalkozó ügyintéző","Szellemi",3654,{"$f":"--ISNUMBER(SEARCH(Adatlap!$C$32,FEOR!A250))","v":1},{"$f":"IF(D250=1,SUMIF($D$2:D250,1),\"\")","v":249},"Hatósági engedélyek kiadásával foglalkozó ügyintéző"]
["Társadalombiztosítási és segélyezési hatósági ügyintéző","Szellemi",3653,{"$f":"--ISNUMBER(SEARCH(Adatlap!$C$32,FEOR!A251))","v":1},{"$f":"IF(D251=1,SUMIF($D$2:D251,1),\"\")","v":250},"Társadalombiztosítási és segélyezési hatósági ügyintéző"]
["Adó- és illetékhivatali ügyintéző","Szellemi",3652,{"$f":"--ISNUMBER(SEARCH(Adatlap!$C$32,FEOR!A252))","v":1},{"$f":"IF(D252=1,SUMIF($D$2:D252,1),\"\")","v":251},"Adó- és illetékhivatali ügyintéző"]
["Vám-  és pénzügyőr","Szellemi",3651,{"$f":"--ISNUMBER(SEARCH(Adatlap!$C$32,FEOR!A253))","v":1},{"$f":"IF(D253=1,SUMIF($D$2:D253,1),\"\")","v":252},"Vám-  és pénzügyőr"]
["Egyéb igazgatási és jogi asszisztens","Szellemi",3649,{"$f":"--ISNUMBER(SEARCH(Adatlap!$C$32,FEOR!A254))","v":1},{"$f":"IF(D254=1,SUMIF($D$2:D254,1),\"\")","v":253},"Egyéb igazgatási és jogi asszisztens"]
["Jogi asszisztens","Szellemi",3642,{"$f":"--ISNUMBER(SEARCH(Adatlap!$C$32,FEOR!A255))","v":1},{"$f":"IF(D255=1,SUMIF($D$2:D255,1),\"\")","v":254},"Jogi asszisztens"]
["Személyi asszisztens","Szellemi",3641,{"$f":"--ISNUMBER(SEARCH(Adatlap!$C$32,FEOR!A256))","v":1},{"$f":"IF(D256=1,SUMIF($D$2:D256,1),\"\")","v":255},"Személyi asszisztens"]
["Egyéb, máshova nem sorolható üzleti jellegű szolgáltatás ügyintézője","Szellemi",3639,{"$f":"--ISNUMBER(SEARCH(Adatlap!$C$32,FEOR!A257))","v":1},{"$f":"IF(D257=1,SUMIF($D$2:D257,1),\"\")","v":256},"Egyéb, máshova nem sorolható üzleti jellegű szolgáltatás ügyintézője"]
["Ingatlanügynök, ingatlanforgalmazási ügyintéző","Szellemi",3633,{"$f":"--ISNUMBER(SEARCH(Adatlap!$C$32,FEOR!A258))","v":1},{"$f":"IF(D258=1,SUMIF($D$2:D258,1),\"\")","v":257},"Ingatlanügynök, ingatlanforgalmazási ügyintéző"]
["Marketing- és PR-ügyintéző","Szellemi",3632,{"$f":"--ISNUMBER(SEARCH(Adatlap!$C$32,FEOR!A259))","v":1},{"$f":"IF(D259=1,SUMIF($D$2:D259,1),\"\")","v":258},{"$f":"IFERROR(INDEX($A$2:$A$486,MATCH(ROW(F258),$E$2:$E$486,0)),\"\")","v":"Marketing- és PR-ügyintéző"}]
["Konferencia- és rendezvényszervező","Szellemi",3631,{"$f":"--ISNUMBER(SEARCH(Adatlap!$C$32,FEOR!A260))","v":1},{"$f":"IF(D260=1,SUMIF($D$2:D260,1),\"\")","v":259},"Konferencia- és rendezvényszervező"]
["Ügynök (a biztosítási ügynök kivételével)","Szellemi",3624,{"$f":"--ISNUMBER(SEARCH(Adatlap!$C$32,FEOR!A261))","v":1},{"$f":"IF(D261=1,SUMIF($D$2:D261,1),\"\")","v":260},"Ügynök (a biztosítási ügynök kivételével)"]
["Anyaggazdálkodó, felvásárló","Szellemi",3623,{"$f":"--ISNUMBER(SEARCH(Adatlap!$C$32,FEOR!A262))","v":1},{"$f":"IF(D262=1,SUMIF($D$2:D262,1),\"\")","v":261},"Anyaggazdálkodó, felvásárló"]
["Kereskedelmi ügyintéző","Szellemi",3622,{"$f":"--ISNUMBER(SEARCH(Adatlap!$C$32,FEOR!A263))","v":1},{"$f":"IF(D263=1,SUMIF($D$2:D263,1),\"\")","v":262},"Kereskedelmi ügyintéző"]
["Biztosítási ügynök, ügyintéző","Szellemi",3621,{"$f":"--ISNUMBER(SEARCH(Adatlap!$C$32,FEOR!A264))","v":1},{"$f":"IF(D264=1,SUMIF($D$2:D264,1),\"\")","v":263},"Biztosítási ügynök, ügyintéző"]
["Értékbecslő, kárbecslő, kárszakértő","Szellemi",3616,{"$f":"--ISNUMBER(SEARCH(Adatlap!$C$32,FEOR!A265))","v":1},{"$f":"IF(D265=1,SUMIF($D$2:D265,1),\"\")","v":264},"Értékbecslő, kárbecslő, kárszakértő"]
["Statisztikai ügyintéző","Szellemi",3615,{"$f":"--ISNUMBER(SEARCH(Adatlap!$C$32,FEOR!A266))","v":1},{"$f":"IF(D266=1,SUMIF($D$2:D266,1),\"\")","v":265},"Statisztikai ügyintéző"]
["Számviteli ügyintéző","Szellemi",3614,{"$f":"--ISNUMBER(SEARCH(Adatlap!$C$32,FEOR!A267))","v":1},{"$f":"IF(D267=1,SUMIF($D$2:D267,1),\"\")","v":266},"Számviteli ügyintéző"]
["Tőzsde- és pénzügyi ügynök, bróker","Szellemi",3613,{"$f":"--ISNUMBER(SEARCH(Adatlap!$C$32,FEOR!A268))","v":1},{"$f":"IF(D268=1,SUMIF($D$2:D268,1),\"\")","v":267},"Tőzsde- és pénzügyi ügynök, bróker"]
["Pénzintézeti ügyintéző","Szellemi",3612,{"$f":"--ISNUMBER(SEARCH(Adatlap!$C$32,FEOR!A269))","v":1},{"$f":"IF(D269=1,SUMIF($D$2:D269,1),\"\")","v":268},"Pénzintézeti ügyintéző"]
["Pénzügyi ügyintéző (a pénzintézeti ügyintéző kivételével)","Szellemi",3611,{"$f":"--ISNUMBER(SEARCH(Adatlap!$C$32,FEOR!A270))","v":1},{"$f":"IF(D270=1,SUMIF($D$2:D270,1),\"\")","v":269},"Pénzügyi ügyintéző (a pénzintézeti ügyintéző kivételével)"]
["Munkaerő-piaci szolgáltatási ügyintéző","Szellemi",3520,{"$f":"--ISNUMBER(SEARCH(Adatlap!$C$32,FEOR!A271))","v":1},{"$f":"IF(D271=1,SUMIF($D$2:D271,1),\"\")","v":270},"Munkaerő-piaci szolgáltatási ügyintéző"]
["Ifjúságsegítő","Szellemi",3515,{"$f":"--ISNUMBER(SEARCH(Adatlap!$C$32,FEOR!A272))","v":1},{"$f":"IF(D272=1,SUMIF($D$2:D272,1),\"\")","v":271}]
["Jelnyelvi tolmács","Szellemi",3514,{"$f":"--ISNUMBER(SEARCH(Adatlap!$C$32,FEOR!A273))","v":1},{"$f":"IF(D273=1,SUMIF($D$2:D273,1),\"\")","v":272}]
["Szociális gondozó, szakgondozó","Szellemi",3513,{"$f":"--ISNUMBER(SEARCH(Adatlap!$C$32,FEOR!A274))","v":1},{"$f":"IF(D274=1,SUMIF($D$2:D274,1),\"\")","v":273},"Szociális gondozó, szakgondozó"]
["Hivatásos nevelőszülő, főállású anya","Szellemi",3512,{"$f":"--ISNUMBER(SEARCH(Adatlap!$C$32,FEOR!A275))","v":1},{"$f":"IF(D275=1,SUMIF($D$2:D275,1),\"\")","v":274},"Hivatásos nevelőszülő, főállású anya"]
["Szociális segítő","Szellemi",3511,{"$f":"--ISNUMBER(SEARCH(Adatlap!$C$32,FEOR!A276))","v":1},{"$f":"IF(D276=1,SUMIF($D$2:D276,1),\"\")","v":275},"Szociális segítő"]
["Oktatási asszisztens","Szellemi",3410,{"$f":"--ISNUMBER(SEARCH(Adatlap!$C$32,FEOR!A277))","v":1},{"$f":"IF(D277=1,SUMIF($D$2:D277,1),\"\")","v":276},"Oktatási asszisztens"]
["Növényorvosi (növényvédelmi) asszisztens","Szellemi",3342,{"$f":"--ISNUMBER(SEARCH(Adatlap!$C$32,FEOR!A278))","v":1},{"$f":"IF(D278=1,SUMIF($D$2:D278,1),\"\")","v":277},"Növényorvosi (növényvédelmi) asszisztens"]
["Állatorvosi asszisztens","Szellemi",3341,{"$f":"--ISNUMBER(SEARCH(Adatlap!$C$32,FEOR!A279))","v":1},{"$f":"IF(D279=1,SUMIF($D$2:D279,1),\"\")","v":278},"Állatorvosi asszisztens"]
["Egyéb, humánegészségügyhöz kapcsolódó foglalkozású","Szellemi",3339,{"$f":"--ISNUMBER(SEARCH(Adatlap!$C$32,FEOR!A280))","v":1},{"$f":"IF(D280=1,SUMIF($D$2:D280,1),\"\")","v":279},"Egyéb, humánegészségügyhöz kapcsolódó foglalkozású"]
["Látszerész","Fizikai",3335,{"$f":"--ISNUMBER(SEARCH(Adatlap!$C$32,FEOR!A281))","v":1},{"$f":"IF(D281=1,SUMIF($D$2:D281,1),\"\")","v":280},"Látszerész"]
["Ortopédiai eszközkészítő","Fizikai",3334,{"$f":"--ISNUMBER(SEARCH(Adatlap!$C$32,FEOR!A282))","v":1},{"$f":"IF(D282=1,SUMIF($D$2:D282,1),\"\")","v":281},"Ortopédiai eszközkészítő"]
["Fogtechnikus","Szellemi",3333,{"$f":"--ISNUMBER(SEARCH(Adatlap!$C$32,FEOR!A283))","v":1},{"$f":"IF(D283=1,SUMIF($D$2:D283,1),\"\")","v":282},"Fogtechnikus"]
["Fizioterápiás asszisztens, masszőr","Szellemi",3332,{"$f":"--ISNUMBER(SEARCH(Adatlap!$C$32,FEOR!A284))","v":1},{"$f":"IF(D284=1,SUMIF($D$2:D284,1),\"\")","v":283},"Fizioterápiás asszisztens, masszőr"]
["Környezet- és foglalkozás-egészségügyi kiegészítő foglalkozású","Szellemi",3331,{"$f":"--ISNUMBER(SEARCH(Adatlap!$C$32,FEOR!A285))","v":1},{"$f":"IF(D285=1,SUMIF($D$2:D285,1),\"\")","v":284},"Környezet- és foglalkozás-egészségügyi kiegészítő foglalkozású"]
["Alternatív gyógymódok alkalmazásának segítője","Szellemi",3327,{"$f":"--ISNUMBER(SEARCH(Adatlap!$C$32,FEOR!A286))","v":1},{"$f":"IF(D286=1,SUMIF($D$2:D286,1),\"\")","v":285},"Alternatív gyógymódok alkalmazásának segítője"]
["Gyógyszertári és gyógyszerellátási asszisztens","Szellemi",3326,{"$f":"--ISNUMBER(SEARCH(Adatlap!$C$32,FEOR!A287))","v":1},{"$f":"IF(D287=1,SUMIF($D$2:D287,1),\"\")","v":286},"Gyógyszertári és gyógyszerellátási asszisztens"]
["Fogászati asszisztens","Szellemi",3325,{"$f":"--ISNUMBER(SEARCH(Adatlap!$C$32,FEOR!A288))","v":1},{"$f":"IF(D288=1,SUMIF($D$2:D288,1),\"\")","v":287},"Fogászati asszisztens"]
["Orvosi laboratóriumi asszisztens","Szellemi",3324,{"$f":"--ISNUMBER(SEARCH(Adatlap!$C$32,FEOR!A289))","v":1},{"$f":"IF(D289=1,SUMIF($D$2:D289,1),\"\")","v":288},"Orvosi laboratóriumi asszisztens"]
["Orvosi képalkotó diagnosztikai és terápiás berendezések kezelője","Szellemi",3323,{"$f":"--ISNUMBER(SEARCH(Adatlap!$C$32,FEOR!A290))","v":1},{"$f":"IF(D290=1,SUMIF($D$2:D290,1),\"\")","v":289},"Orvosi képalkotó diagnosztikai és terápiás berendezések kezelője"]
["Egészségügyi dokumentátor ","Szellemi",3322,{"$f":"--ISNUMBER(SEARCH(Adatlap!$C$32,FEOR!A291))","v":1},{"$f":"IF(D291=1,SUMIF($D$2:D291,1),\"\")","v":290},"Egészségügyi dokumentátor "]
["Általános egészségügyi asszisztens","Szellemi",3321,{"$f":"--ISNUMBER(SEARCH(Adatlap!$C$32,FEOR!A292))","v":1},{"$f":"IF(D292=1,SUMIF($D$2:D292,1),\"\")","v":291},"Általános egészségügyi asszisztens"]
["Szülész(nő)i tevékenység segítője","Szellemi",3312,{"$f":"--ISNUMBER(SEARCH(Adatlap!$C$32,FEOR!A293))","v":1},{"$f":"IF(D293=1,SUMIF($D$2:D293,1),\"\")","v":292},"Szülész(nő)i tevékenység segítője"]
["Ápoló, szakápoló","Szellemi",3311,{"$f":"--ISNUMBER(SEARCH(Adatlap!$C$32,FEOR!A294))","v":1},{"$f":"IF(D294=1,SUMIF($D$2:D294,1),\"\")","v":293},"Ápoló, szakápoló"]
["Konyhafőnök, séf","Fizikai",3222,{"$f":"--ISNUMBER(SEARCH(Adatlap!$C$32,FEOR!A295))","v":1},{"$f":"IF(D295=1,SUMIF($D$2:D295,1),\"\")","v":294},"Konyhafőnök, séf"]
["Irodai szakmai irányító, felügyelő","Szellemi",3221,{"$f":"--ISNUMBER(SEARCH(Adatlap!$C$32,FEOR!A296))","v":1},{"$f":"IF(D296=1,SUMIF($D$2:D296,1),\"\")","v":295},"Irodai szakmai irányító, felügyelő"]
["Építőipari szakmai irányító, felügyelő","Szellemi",3213,{"$f":"--ISNUMBER(SEARCH(Adatlap!$C$32,FEOR!A297))","v":1},{"$f":"IF(D297=1,SUMIF($D$2:D297,1),\"\")","v":296},"Építőipari szakmai irányító, felügyelő"]
["Feldolgozóipari szakmai irányító, felügyelő","Szellemi",3212,{"$f":"--ISNUMBER(SEARCH(Adatlap!$C$32,FEOR!A298))","v":1},{"$f":"IF(D298=1,SUMIF($D$2:D298,1),\"\")","v":297},"Feldolgozóipari szakmai irányító, felügyelő"]
["Bányászati szakmai irányító, felügyelő","Szellemi",3211,{"$f":"--ISNUMBER(SEARCH(Adatlap!$C$32,FEOR!A299))","v":1},{"$f":"IF(D299=1,SUMIF($D$2:D299,1),\"\")","v":298},"Bányászati szakmai irányító, felügyelő"]
["Egyéb műszaki foglalkozású","Szellemi",3190,{"$f":"--ISNUMBER(SEARCH(Adatlap!$C$32,FEOR!A300))","v":1},{"$f":"IF(D300=1,SUMIF($D$2:D300,1),\"\")","v":299},"Egyéb műszaki foglalkozású"]
["Légiforgalmi irányítástechnikai berendezések üzemeltetője","Szellemi",3174,{"$f":"--ISNUMBER(SEARCH(Adatlap!$C$32,FEOR!A301))","v":1},{"$f":"IF(D301=1,SUMIF($D$2:D301,1),\"\")","v":300},"Légiforgalmi irányítástechnikai berendezések üzemeltetője"]
["Légiforgalmi irányító","Szellemi",3173,{"$f":"--ISNUMBER(SEARCH(Adatlap!$C$32,FEOR!A302))","v":1},{"$f":"IF(D302=1,SUMIF($D$2:D302,1),\"\")","v":301},"Légiforgalmi irányító"]
["Légijármű-vezető, hajózómérnök","Szellemi",3172,{"$f":"--ISNUMBER(SEARCH(Adatlap!$C$32,FEOR!A303))","v":1},{"$f":"IF(D303=1,SUMIF($D$2:D303,1),\"\")","v":302},"Légijármű-vezető, hajózómérnök"]
["Tengeri és belvízi hajóparancsnok, fedélzeti tiszt","Szellemi",3171,{"$f":"--ISNUMBER(SEARCH(Adatlap!$C$32,FEOR!A304))","v":1},{"$f":"IF(D304=1,SUMIF($D$2:D304,1),\"\")","v":303},"Tengeri és belvízi hajóparancsnok, fedélzeti tiszt"]
["Munkavédelmi és üzembiztonsági foglalkozású","Szellemi",3163,{"$f":"--ISNUMBER(SEARCH(Adatlap!$C$32,FEOR!A305))","v":1},{"$f":"IF(D305=1,SUMIF($D$2:D305,1),\"\")","v":304},"Munkavédelmi és üzembiztonsági foglalkozású"]
["Energetikus","Szellemi",3162,{"$f":"--ISNUMBER(SEARCH(Adatlap!$C$32,FEOR!A306))","v":1},{"$f":"IF(D306=1,SUMIF($D$2:D306,1),\"\")","v":305},"Energetikus"]
["Munka- és termelésszervező ","Szellemi",3161,{"$f":"--ISNUMBER(SEARCH(Adatlap!$C$32,FEOR!A307))","v":1},{"$f":"IF(D307=1,SUMIF($D$2:D307,1),\"\")","v":306},"Munka- és termelésszervező "]
["Egyéb folyamatirányító berendezés vezérlője ","Fizikai",3159,{"$f":"--ISNUMBER(SEARCH(Adatlap!$C$32,FEOR!A308))","v":1},{"$f":"IF(D308=1,SUMIF($D$2:D308,1),\"\")","v":307},"Egyéb folyamatirányító berendezés vezérlője "]
["Fémgyártási berendezés vezérlője","Fizikai",3155,{"$f":"--ISNUMBER(SEARCH(Adatlap!$C$32,FEOR!A309))","v":1},{"$f":"IF(D309=1,SUMIF($D$2:D309,1),\"\")","v":308},"Fémgyártási berendezés vezérlője"]
["Kőolaj- és földgázfinomító berendezés vezérlője","Fizikai",3154,{"$f":"--ISNUMBER(SEARCH(Adatlap!$C$32,FEOR!A310))","v":1},{"$f":"IF(D310=1,SUMIF($D$2:D310,1),\"\")","v":309},"Kőolaj- és földgázfinomító berendezés vezérlője"]
["Vegyipari alapanyag-feldolgozó berendezés vezérlője","Fizikai",3153,{"$f":"--ISNUMBER(SEARCH(Adatlap!$C$32,FEOR!A311))","v":1},{"$f":"IF(D311=1,SUMIF($D$2:D311,1),\"\")","v":310},"Vegyipari alapanyag-feldolgozó berendezés vezérlője"]
["Égető-, víz- és csatornaművi berendezés vezérlője","Fizikai",3152,{"$f":"--ISNUMBER(SEARCH(Adatlap!$C$32,FEOR!A312))","v":1},{"$f":"IF(D312=1,SUMIF($D$2:D312,1),\"\")","v":311},"Égető-, víz- és csatornaművi berendezés vezérlője"]
["Energetikai (erőművi) berendezés vezérlője","Fizikai",3151,{"$f":"--ISNUMBER(SEARCH(Adatlap!$C$32,FEOR!A313))","v":1},{"$f":"IF(D313=1,SUMIF($D$2:D313,1),\"\")","v":312},"Energetikai (erőművi) berendezés vezérlője"]
["Telekommunikációs technikus","Szellemi",3146,{"$f":"--ISNUMBER(SEARCH(Adatlap!$C$32,FEOR!A314))","v":1},{"$f":"IF(D314=1,SUMIF($D$2:D314,1),\"\")","v":313},"Telekommunikációs technikus"]
["Műsorszóró és audiovizuális technikus","Szellemi",3145,{"$f":"--ISNUMBER(SEARCH(Adatlap!$C$32,FEOR!A315))","v":1},{"$f":"IF(D315=1,SUMIF($D$2:D315,1),\"\")","v":314},"Műsorszóró és audiovizuális technikus"]
["Webrendszer- (hálózati) technikus","Szellemi",3144,{"$f":"--ISNUMBER(SEARCH(Adatlap!$C$32,FEOR!A316))","v":1},{"$f":"IF(D316=1,SUMIF($D$2:D316,1),\"\")","v":315},"Webrendszer- (hálózati) technikus"]
["Számítógéphálózat- és rendszertechnikus","Szellemi",3143,{"$f":"--ISNUMBER(SEARCH(Adatlap!$C$32,FEOR!A317))","v":1},{"$f":"IF(D317=1,SUMIF($D$2:D317,1),\"\")","v":316},"Számítógéphálózat- és rendszertechnikus"]
["Informatikai és kommunikációs rendszerek felhasználóit támogató technikus","Szellemi",3142,{"$f":"--ISNUMBER(SEARCH(Adatlap!$C$32,FEOR!A318))","v":1},{"$f":"IF(D318=1,SUMIF($D$2:D318,1),\"\")","v":317},"Informatikai és kommunikációs rendszerek felhasználóit támogató technikus"]
["Informatikai és kommunikációs rendszereket kezelő technikus","Szellemi",3141,{"$f":"--ISNUMBER(SEARCH(Adatlap!$C$32,FEOR!A319))","v":1},{"$f":"IF(D319=1,SUMIF($D$2:D319,1),\"\")","v":318},"Informatikai és kommunikációs rendszereket kezelő technikus"]
["Egyéb, máshova nem sorolható technikus","Szellemi",3139,{"$f":"--ISNUMBER(SEARCH(Adatlap!$C$32,FEOR!A320))","v":1},{"$f":"IF(D320=1,SUMIF($D$2:D320,1),\"\")","v":319},"Egyéb, máshova nem sorolható technikus"]
["Műszaki rajzoló, szerkesztő","Szellemi",3136,{"$f":"--ISNUMBER(SEARCH(Adatlap!$C$32,FEOR!A321))","v":1},{"$f":"IF(D321=1,SUMIF($D$2:D321,1),\"\")","v":320},"Műszaki rajzoló, szerkesztő"]
["Minőségbiztosítási technikus","Szellemi",3135,{"$f":"--ISNUMBER(SEARCH(Adatlap!$C$32,FEOR!A322))","v":1},{"$f":"IF(D322=1,SUMIF($D$2:D322,1),\"\")","v":321},"Minőségbiztosítási technikus"]
["Környezetvédelmi technikus","Szellemi",3134,{"$f":"--ISNUMBER(SEARCH(Adatlap!$C$32,FEOR!A323))","v":1},{"$f":"IF(D323=1,SUMIF($D$2:D323,1),\"\")","v":322},{"$f":"IFERROR(INDEX($A$2:$A$486,MATCH(ROW(F322),$E$2:$E$486,0)),\"\")","v":"Környezetvédelmi technikus"}]
["Földmérő és térinformatikai technikus ","Szellemi",3133,{"$f":"--ISNUMBER(SEARCH(Adatlap!$C$32,FEOR!A324))","v":1},{"$f":"IF(D324=1,SUMIF($D$2:D324,1),\"\")","v":323},"Földmérő és térinformatikai technikus "]
["Erdő- és természetvédelmi technikus","Szellemi",3132,{"$f":"--ISNUMBER(SEARCH(Adatlap!$C$32,FEOR!A325))","v":1},{"$f":"IF(D325=1,SUMIF($D$2:D325,1),\"\")","v":324},"Erdő- és természetvédelmi technikus"]
["Mezőgazdasági technikus","Szellemi",3131,{"$f":"--ISNUMBER(SEARCH(Adatlap!$C$32,FEOR!A326))","v":1},{"$f":"IF(D326=1,SUMIF($D$2:D326,1),\"\")","v":325},"Mezőgazdasági technikus"]
["Villamosipari technikus (elektronikai technikus)","Szellemi",3122,{"$f":"--ISNUMBER(SEARCH(Adatlap!$C$32,FEOR!A327))","v":1},{"$f":"IF(D327=1,SUMIF($D$2:D327,1),\"\")","v":326},"Villamosipari technikus (elektronikai technikus)"]
["Villamosipari technikus (energetikai technikus)","Szellemi",3121,{"$f":"--ISNUMBER(SEARCH(Adatlap!$C$32,FEOR!A328))","v":1},{"$f":"IF(D328=1,SUMIF($D$2:D328,1),\"\")","v":327},"Villamosipari technikus (energetikai technikus)"]
["Építő- és építésztechnikus","Szellemi",3117,{"$f":"--ISNUMBER(SEARCH(Adatlap!$C$32,FEOR!A329))","v":1},{"$f":"IF(D329=1,SUMIF($D$2:D329,1),\"\")","v":328},"Építő- és építésztechnikus"]
["Gépésztechnikus","Szellemi",3116,{"$f":"--ISNUMBER(SEARCH(Adatlap!$C$32,FEOR!A330))","v":1},{"$f":"IF(D330=1,SUMIF($D$2:D330,1),\"\")","v":329},"Gépésztechnikus"]
["Vegyésztechnikus","Szellemi",3115,{"$f":"--ISNUMBER(SEARCH(Adatlap!$C$32,FEOR!A331))","v":1},{"$f":"IF(D331=1,SUMIF($D$2:D331,1),\"\")","v":330},"Vegyésztechnikus"]
["Fa- és könnyűipari technikus","Szellemi",3114,{"$f":"--ISNUMBER(SEARCH(Adatlap!$C$32,FEOR!A332))","v":1},{"$f":"IF(D332=1,SUMIF($D$2:D332,1),\"\")","v":331},"Fa- és könnyűipari technikus"]
["Élelmiszer-ipari technikus","Szellemi",3113,{"$f":"--ISNUMBER(SEARCH(Adatlap!$C$32,FEOR!A333))","v":1},{"$f":"IF(D333=1,SUMIF($D$2:D333,1),\"\")","v":332},"Élelmiszer-ipari technikus"]
["Kohó- és anyagtechnikus","Szellemi",3112,{"$f":"--ISNUMBER(SEARCH(Adatlap!$C$32,FEOR!A334))","v":1},{"$f":"IF(D334=1,SUMIF($D$2:D334,1),\"\")","v":333},"Kohó- és anyagtechnikus"]
["Bányászati technikus","Szellemi",3111,{"$f":"--ISNUMBER(SEARCH(Adatlap!$C$32,FEOR!A335))","v":1},{"$f":"IF(D335=1,SUMIF($D$2:D335,1),\"\")","v":334},"Bányászati technikus"]
["Egyéb, magasan képzett ügyintéző","Szellemi",2910,{"$f":"--ISNUMBER(SEARCH(Adatlap!$C$32,FEOR!A336))","v":1},{"$f":"IF(D336=1,SUMIF($D$2:D336,1),\"\")","v":335},"Egyéb, magasan képzett ügyintéző"]
["Pap (lelkész), egyházi foglalkozású","Szellemi",2730,{"$f":"--ISNUMBER(SEARCH(Adatlap!$C$32,FEOR!A337))","v":1},{"$f":"IF(D337=1,SUMIF($D$2:D337,1),\"\")","v":336},"Pap (lelkész), egyházi foglalkozású"]
["Egyéb alkotó- és előadó-művészi foglalkozású (felsőfokú képzettséghez kapcsolódó)","Szellemi",2729,{"$f":"--ISNUMBER(SEARCH(Adatlap!$C$32,FEOR!A338))","v":1},{"$f":"IF(D338=1,SUMIF($D$2:D338,1),\"\")","v":337},"Egyéb alkotó- és előadó-művészi foglalkozású (felsőfokú képzettséghez kapcsolódó)"]
["Cirkuszi és hasonló előadóművész","Szellemi",2728,{"$f":"--ISNUMBER(SEARCH(Adatlap!$C$32,FEOR!A339))","v":1},{"$f":"IF(D339=1,SUMIF($D$2:D339,1),\"\")","v":338},"Cirkuszi és hasonló előadóművész"]
["Táncművész, koreográfus","Szellemi",2727,{"$f":"--ISNUMBER(SEARCH(Adatlap!$C$32,FEOR!A340))","v":1},{"$f":"IF(D340=1,SUMIF($D$2:D340,1),\"\")","v":339},"Táncművész, koreográfus"]
["Színész,  bábművész","Szellemi",2726,{"$f":"--ISNUMBER(SEARCH(Adatlap!$C$32,FEOR!A341))","v":1},{"$f":"IF(D341=1,SUMIF($D$2:D341,1),\"\")","v":340},"Színész,  bábművész"]
["Rendező, operatőr","Szellemi",2725,{"$f":"--ISNUMBER(SEARCH(Adatlap!$C$32,FEOR!A342))","v":1},{"$f":"IF(D342=1,SUMIF($D$2:D342,1),\"\")","v":341},"Rendező, operatőr"]
["Zeneszerző, zenész, énekes","Szellemi",2724,{"$f":"--ISNUMBER(SEARCH(Adatlap!$C$32,FEOR!A343))","v":1},{"$f":"IF(D343=1,SUMIF($D$2:D343,1),\"\")","v":342},"Zeneszerző, zenész, énekes"]
["Iparművész, gyártmány- és ruhatervező","Szellemi",2723,{"$f":"--ISNUMBER(SEARCH(Adatlap!$C$32,FEOR!A344))","v":1},{"$f":"IF(D344=1,SUMIF($D$2:D344,1),\"\")","v":343},"Iparművész, gyártmány- és ruhatervező"]
["Képzőművész","Szellemi",2722,{"$f":"--ISNUMBER(SEARCH(Adatlap!$C$32,FEOR!A345))","v":1},{"$f":"IF(D345=1,SUMIF($D$2:D345,1),\"\")","v":344},"Képzőművész"]
["Író (újságíró nélkül)","Szellemi",2721,{"$f":"--ISNUMBER(SEARCH(Adatlap!$C$32,FEOR!A346))","v":1},{"$f":"IF(D346=1,SUMIF($D$2:D346,1),\"\")","v":345},"Író (újságíró nélkül)"]
["Egyéb kulturális és sportfoglalkozású (felsőfokú képzettséghez kapcsolódó)","Szellemi",2719,{"$f":"--ISNUMBER(SEARCH(Adatlap!$C$32,FEOR!A347))","v":1},{"$f":"IF(D347=1,SUMIF($D$2:D347,1),\"\")","v":346},"Egyéb kulturális és sportfoglalkozású (felsőfokú képzettséghez kapcsolódó)"]
["Szakképzett edző, sportszervező, -irányító","Szellemi",2717,{"$f":"--ISNUMBER(SEARCH(Adatlap!$C$32,FEOR!A348))","v":1},{"$f":"IF(D348=1,SUMIF($D$2:D348,1),\"\")","v":347},"Szakképzett edző, sportszervező, -irányító"]
["Újságíró, rádióműsor-, televízióműsor-szerkesztő","Szellemi",2716,{"$f":"--ISNUMBER(SEARCH(Adatlap!$C$32,FEOR!A349))","v":1},{"$f":"IF(D349=1,SUMIF($D$2:D349,1),\"\")","v":348},"Újságíró, rádióműsor-, televízióműsor-szerkesztő"]
["Könyv- és lapkiadó szerkesztője","Szellemi",2715,{"$f":"--ISNUMBER(SEARCH(Adatlap!$C$32,FEOR!A350))","v":1},{"$f":"IF(D350=1,SUMIF($D$2:D350,1),\"\")","v":349},"Könyv- és lapkiadó szerkesztője"]
["Kulturális szervező","Szellemi",2714,{"$f":"--ISNUMBER(SEARCH(Adatlap!$C$32,FEOR!A351))","v":1},{"$f":"IF(D351=1,SUMIF($D$2:D351,1),\"\")","v":350},"Kulturális szervező"]
["Muzeológus, múzeumi gyűjteménygondnok","Szellemi",2713,{"$f":"--ISNUMBER(SEARCH(Adatlap!$C$32,FEOR!A352))","v":1},{"$f":"IF(D352=1,SUMIF($D$2:D352,1),\"\")","v":351},"Muzeológus, múzeumi gyűjteménygondnok"]
["Levéltáros","Szellemi",2712,{"$f":"--ISNUMBER(SEARCH(Adatlap!$C$32,FEOR!A353))","v":1},{"$f":"IF(D353=1,SUMIF($D$2:D353,1),\"\")","v":352},"Levéltáros"]
["Könyvtáros, informatikus könyvtáros","Szellemi",2711,{"$f":"--ISNUMBER(SEARCH(Adatlap!$C$32,FEOR!A354))","v":1},{"$f":"IF(D354=1,SUMIF($D$2:D354,1),\"\")","v":353},"Könyvtáros, informatikus könyvtáros"]
["Egyéb társadalomtudományi foglalkozású","Szellemi",2629,{"$f":"--ISNUMBER(SEARCH(Adatlap!$C$32,FEOR!A355))","v":1},{"$f":"IF(D355=1,SUMIF($D$2:D355,1),\"\")","v":354},"Egyéb társadalomtudományi foglalkozású"]
["Pszichológus","Szellemi",2628,{"$f":"--ISNUMBER(SEARCH(Adatlap!$C$32,FEOR!A356))","v":1},{"$f":"IF(D356=1,SUMIF($D$2:D356,1),\"\")","v":355},"Pszichológus"]
["Nyelvész, fordító, tolmács","Szellemi",2627,{"$f":"--ISNUMBER(SEARCH(Adatlap!$C$32,FEOR!A357))","v":1},{"$f":"IF(D357=1,SUMIF($D$2:D357,1),\"\")","v":356},"Nyelvész, fordító, tolmács"]
["Szociológus, demográfus","Szellemi",2626,{"$f":"--ISNUMBER(SEARCH(Adatlap!$C$32,FEOR!A358))","v":1},{"$f":"IF(D358=1,SUMIF($D$2:D358,1),\"\")","v":357},"Szociológus, demográfus"]
["Statisztikus","Szellemi",2625,{"$f":"--ISNUMBER(SEARCH(Adatlap!$C$32,FEOR!A359))","v":1},{"$f":"IF(D359=1,SUMIF($D$2:D359,1),\"\")","v":358},"Statisztikus"]
["Elemző közgazdász","Szellemi",2624,{"$f":"--ISNUMBER(SEARCH(Adatlap!$C$32,FEOR!A360))","v":1},{"$f":"IF(D360=1,SUMIF($D$2:D360,1),\"\")","v":359},"Elemző közgazdász"]
["Néprajzkutató","Szellemi",2623,{"$f":"--ISNUMBER(SEARCH(Adatlap!$C$32,FEOR!A361))","v":1},{"$f":"IF(D361=1,SUMIF($D$2:D361,1),\"\")","v":360},"Néprajzkutató"]
["Történész, régész","Szellemi",2622,{"$f":"--ISNUMBER(SEARCH(Adatlap!$C$32,FEOR!A362))","v":1},{"$f":"IF(D362=1,SUMIF($D$2:D362,1),\"\")","v":361},"Történész, régész"]
["Filozófus, politológus","Szellemi",2621,{"$f":"--ISNUMBER(SEARCH(Adatlap!$C$32,FEOR!A363))","v":1},{"$f":"IF(D363=1,SUMIF($D$2:D363,1),\"\")","v":362},"Filozófus, politológus"]
["Egyéb jogi foglalkozású","Szellemi",2619,{"$f":"--ISNUMBER(SEARCH(Adatlap!$C$32,FEOR!A364))","v":1},{"$f":"IF(D364=1,SUMIF($D$2:D364,1),\"\")","v":363},"Egyéb jogi foglalkozású"]
["Ügyvéd","Szellemi",2615,{"$f":"--ISNUMBER(SEARCH(Adatlap!$C$32,FEOR!A365))","v":1},{"$f":"IF(D365=1,SUMIF($D$2:D365,1),\"\")","v":364},"Ügyvéd"]
["Közjegyző","Szellemi",2614,{"$f":"--ISNUMBER(SEARCH(Adatlap!$C$32,FEOR!A366))","v":1},{"$f":"IF(D366=1,SUMIF($D$2:D366,1),\"\")","v":365},"Közjegyző"]
["Bíró","Szellemi",2613,{"$f":"--ISNUMBER(SEARCH(Adatlap!$C$32,FEOR!A367))","v":1},{"$f":"IF(D367=1,SUMIF($D$2:D367,1),\"\")","v":366},"Bíró"]
["Ügyész","Szellemi",2612,{"$f":"--ISNUMBER(SEARCH(Adatlap!$C$32,FEOR!A368))","v":1},{"$f":"IF(D368=1,SUMIF($D$2:D368,1),\"\")","v":367},"Ügyész"]
["Jogász, jogtanácsos","Szellemi",2611,{"$f":"--ISNUMBER(SEARCH(Adatlap!$C$32,FEOR!A369))","v":1},{"$f":"IF(D369=1,SUMIF($D$2:D369,1),\"\")","v":368},"Jogász, jogtanácsos"]
["Informatikai és telekommunikációs technológiai termékek értékesítését tervező, szervező","Szellemi",2534,{"$f":"--ISNUMBER(SEARCH(Adatlap!$C$32,FEOR!A370))","v":1},{"$f":"IF(D370=1,SUMIF($D$2:D370,1),\"\")","v":369},"Informatikai és telekommunikációs technológiai termékek értékesítését tervező, szervező"]
["Kereskedelmi tervező, szervező ","Szellemi",2533,{"$f":"--ISNUMBER(SEARCH(Adatlap!$C$32,FEOR!A371))","v":1},{"$f":"IF(D371=1,SUMIF($D$2:D371,1),\"\")","v":370},"Kereskedelmi tervező, szervező "]
["PR-tevékenységet tervező, szervező","Szellemi",2532,{"$f":"--ISNUMBER(SEARCH(Adatlap!$C$32,FEOR!A372))","v":1},{"$f":"IF(D372=1,SUMIF($D$2:D372,1),\"\")","v":371},"PR-tevékenységet tervező, szervező"]
["Piackutató, reklám- és marketingtevékenységet tervező, szervező","Szellemi",2531,{"$f":"--ISNUMBER(SEARCH(Adatlap!$C$32,FEOR!A373))","v":1},{"$f":"IF(D373=1,SUMIF($D$2:D373,1),\"\")","v":372},"Piackutató, reklám- és marketingtevékenységet tervező, szervező"]
["Képzési és személyzetfejlesztési szakértő","Szellemi",2524,{"$f":"--ISNUMBER(SEARCH(Adatlap!$C$32,FEOR!A374))","v":1},{"$f":"IF(D374=1,SUMIF($D$2:D374,1),\"\")","v":373},"Képzési és személyzetfejlesztési szakértő"]
["Személyzeti és pályaválasztási szakértő","Szellemi",2523,{"$f":"--ISNUMBER(SEARCH(Adatlap!$C$32,FEOR!A375))","v":1},{"$f":"IF(D375=1,SUMIF($D$2:D375,1),\"\")","v":374},"Személyzeti és pályaválasztási szakértő"]
["Üzletpolitikai elemző, szervező","Szellemi",2522,{"$f":"--ISNUMBER(SEARCH(Adatlap!$C$32,FEOR!A376))","v":1},{"$f":"IF(D376=1,SUMIF($D$2:D376,1),\"\")","v":375},"Üzletpolitikai elemző, szervező"]
["Szervezetirányítási elemző, szervező ","Szellemi",2521,{"$f":"--ISNUMBER(SEARCH(Adatlap!$C$32,FEOR!A377))","v":1},{"$f":"IF(D377=1,SUMIF($D$2:D377,1),\"\")","v":376},"Szervezetirányítási elemző, szervező "]
["Kontroller","Szellemi",2514,{"$f":"--ISNUMBER(SEARCH(Adatlap!$C$32,FEOR!A378))","v":1},{"$f":"IF(D378=1,SUMIF($D$2:D378,1),\"\")","v":377},"Kontroller"]
["Könyvvizsgáló, könyvelő, könyvszakértő","Szellemi",2513,{"$f":"--ISNUMBER(SEARCH(Adatlap!$C$32,FEOR!A379))","v":1},{"$f":"IF(D379=1,SUMIF($D$2:D379,1),\"\")","v":378},"Könyvvizsgáló, könyvelő, könyvszakértő"]
["Adótanácsadó, adószakértő","Szellemi",2512,{"$f":"--ISNUMBER(SEARCH(Adatlap!$C$32,FEOR!A380))","v":1},{"$f":"IF(D380=1,SUMIF($D$2:D380,1),\"\")","v":379},"Adótanácsadó, adószakértő"]
["Pénzügyi elemző és befektetési tanácsadó","Szellemi",2511,{"$f":"--ISNUMBER(SEARCH(Adatlap!$C$32,FEOR!A381))","v":1},{"$f":"IF(D381=1,SUMIF($D$2:D381,1),\"\")","v":380},"Pénzügyi elemző és befektetési tanácsadó"]
["Egyéb szakképzett oktató, nevelő","Szellemi",2499,{"$f":"--ISNUMBER(SEARCH(Adatlap!$C$32,FEOR!A382))","v":1},{"$f":"IF(D382=1,SUMIF($D$2:D382,1),\"\")","v":381},"Egyéb szakképzett oktató, nevelő"]
["Informatikatanár (iskolarendszeren kívül)","Szellemi",2495,{"$f":"--ISNUMBER(SEARCH(Adatlap!$C$32,FEOR!A383))","v":1},{"$f":"IF(D383=1,SUMIF($D$2:D383,1),\"\")","v":382},"Informatikatanár (iskolarendszeren kívül)"]
["Egyéb művészetek tanára (iskolarendszeren kívül)","Szellemi",2494,{"$f":"--ISNUMBER(SEARCH(Adatlap!$C$32,FEOR!A384))","v":1},{"$f":"IF(D384=1,SUMIF($D$2:D384,1),\"\")","v":383},"Egyéb művészetek tanára (iskolarendszeren kívül)"]
["Zenetanár (iskolarendszeren kívül)","Szellemi",2493,{"$f":"--ISNUMBER(SEARCH(Adatlap!$C$32,FEOR!A385))","v":1},{"$f":"IF(D385=1,SUMIF($D$2:D385,1),\"\")","v":384},"Zenetanár (iskolarendszeren kívül)"]
["Nyelvtanár (iskolarendszeren kívül)","Szellemi",2492,{"$f":"--ISNUMBER(SEARCH(Adatlap!$C$32,FEOR!A386))","v":1},{"$f":"IF(D386=1,SUMIF($D$2:D386,1),\"\")","v":385},"Nyelvtanár (iskolarendszeren kívül)"]
["Pedagógiai szakértő, szaktanácsadó","Szellemi",2491,{"$f":"--ISNUMBER(SEARCH(Adatlap!$C$32,FEOR!A387))","v":1},{"$f":"IF(D387=1,SUMIF($D$2:D387,1),\"\")","v":386},{"$f":"IFERROR(INDEX($A$2:$A$486,MATCH(ROW(F386),$E$2:$E$486,0)),\"\")","v":"Pedagógiai szakértő, szaktanácsadó"}]
["Konduktor","Szellemi",2442,{"$f":"--ISNUMBER(SEARCH(Adatlap!$C$32,FEOR!A388))","v":1},{"$f":"IF(D388=1,SUMIF($D$2:D388,1),\"\")","v":387},"Konduktor"]
["Gyógypedagógus","Szellemi",2441,{"$f":"--ISNUMBER(SEARCH(Adatlap!$C$32,FEOR!A389))","v":1},{"$f":"IF(D389=1,SUMIF($D$2:D389,1),\"\")","v":388},"Gyógypedagógus"]
["Csecsemő- és kisgyermeknevelő, óvodapedagógus","Szellemi",2432,{"$f":"--ISNUMBER(SEARCH(Adatlap!$C$32,FEOR!A390))","v":1},{"$f":"IF(D390=1,SUMIF($D$2:D390,1),\"\")","v":389},"Csecsemő- és kisgyermeknevelő, óvodapedagógus"]
["Általános iskolai tanár, tanító","Szellemi",2431,{"$f":"--ISNUMBER(SEARCH(Adatlap!$C$32,FEOR!A391))","v":1},{"$f":"IF(D391=1,SUMIF($D$2:D391,1),\"\")","v":390},"Általános iskolai tanár, tanító"]
["Középfokú nevelési-oktatási intézményi szakoktató, gyakorlati oktató","Szellemi",2422,{"$f":"--ISNUMBER(SEARCH(Adatlap!$C$32,FEOR!A392))","v":1},{"$f":"IF(D392=1,SUMIF($D$2:D392,1),\"\")","v":391},"Középfokú nevelési-oktatási intézményi szakoktató, gyakorlati oktató"]
["Középiskolai tanár","Szellemi",2421,{"$f":"--ISNUMBER(SEARCH(Adatlap!$C$32,FEOR!A393))","v":1},{"$f":"IF(D393=1,SUMIF($D$2:D393,1),\"\")","v":392},"Középiskolai tanár"]
["Egyetemi, főiskolai oktató, tanár","Szellemi",2410,{"$f":"--ISNUMBER(SEARCH(Adatlap!$C$32,FEOR!A394))","v":1},{"$f":"IF(D394=1,SUMIF($D$2:D394,1),\"\")","v":393},"Egyetemi, főiskolai oktató, tanár"]
["Szociális munkás és tanácsadó","Szellemi",2312,{"$f":"--ISNUMBER(SEARCH(Adatlap!$C$32,FEOR!A395))","v":1},{"$f":"IF(D395=1,SUMIF($D$2:D395,1),\"\")","v":394},"Szociális munkás és tanácsadó"]
["Szociálpolitikus","Szellemi",2311,{"$f":"--ISNUMBER(SEARCH(Adatlap!$C$32,FEOR!A396))","v":1},{"$f":"IF(D396=1,SUMIF($D$2:D396,1),\"\")","v":395},"Szociálpolitikus"]
["Növényorvos (növényvédelmi szakértő)","Szellemi",2242,{"$f":"--ISNUMBER(SEARCH(Adatlap!$C$32,FEOR!A397))","v":1},{"$f":"IF(D397=1,SUMIF($D$2:D397,1),\"\")","v":396},"Növényorvos (növényvédelmi szakértő)"]
["Állatorvos","Szellemi",2241,{"$f":"--ISNUMBER(SEARCH(Adatlap!$C$32,FEOR!A398))","v":1},{"$f":"IF(D398=1,SUMIF($D$2:D398,1),\"\")","v":397},"Állatorvos"]
["Szülész(nő) (felsőfokú képzettséghez kapcsolódó) ","Szellemi",2232,{"$f":"--ISNUMBER(SEARCH(Adatlap!$C$32,FEOR!A399))","v":1},{"$f":"IF(D399=1,SUMIF($D$2:D399,1),\"\")","v":398},"Szülész(nő) (felsőfokú képzettséghez kapcsolódó) "]
["Ápoló (felsőfokú képzettséghez kapcsolódó) ","Szellemi",2231,{"$f":"--ISNUMBER(SEARCH(Adatlap!$C$32,FEOR!A400))","v":1},{"$f":"IF(D400=1,SUMIF($D$2:D400,1),\"\")","v":399},"Ápoló (felsőfokú képzettséghez kapcsolódó) "]
["Egyéb humán-egészségügyi (társ)foglalkozású","Szellemi",2229,{"$f":"--ISNUMBER(SEARCH(Adatlap!$C$32,FEOR!A401))","v":1},{"$f":"IF(D401=1,SUMIF($D$2:D401,1),\"\")","v":400},"Egyéb humán-egészségügyi (társ)foglalkozású"]
["Alternatív gyógymódot alkalmazó","Szellemi",2228,{"$f":"--ISNUMBER(SEARCH(Adatlap!$C$32,FEOR!A402))","v":1},{"$f":"IF(D402=1,SUMIF($D$2:D402,1),\"\")","v":401},"Alternatív gyógymódot alkalmazó"]
["Hallás- és beszédterapeuta","Szellemi",2227,{"$f":"--ISNUMBER(SEARCH(Adatlap!$C$32,FEOR!A403))","v":1},{"$f":"IF(D403=1,SUMIF($D$2:D403,1),\"\")","v":402},"Hallás- és beszédterapeuta"]
["Mentőtiszt","Szellemi",2226,{"$f":"--ISNUMBER(SEARCH(Adatlap!$C$32,FEOR!A404))","v":1},{"$f":"IF(D404=1,SUMIF($D$2:D404,1),\"\")","v":403},"Mentőtiszt"]
["Védőnő","Szellemi",2225,{"$f":"--ISNUMBER(SEARCH(Adatlap!$C$32,FEOR!A405))","v":1},{"$f":"IF(D405=1,SUMIF($D$2:D405,1),\"\")","v":404},"Védőnő"]
["Gyógytornász","Szellemi",2224,{"$f":"--ISNUMBER(SEARCH(Adatlap!$C$32,FEOR!A406))","v":1},{"$f":"IF(D406=1,SUMIF($D$2:D406,1),\"\")","v":405},"Gyógytornász"]
["Dietetikus és táplálkozási tanácsadó","Szellemi",2223,{"$f":"--ISNUMBER(SEARCH(Adatlap!$C$32,FEOR!A407))","v":1},{"$f":"IF(D407=1,SUMIF($D$2:D407,1),\"\")","v":406},"Dietetikus és táplálkozási tanácsadó"]
["Optometrista","Szellemi",2222,{"$f":"--ISNUMBER(SEARCH(Adatlap!$C$32,FEOR!A408))","v":1},{"$f":"IF(D408=1,SUMIF($D$2:D408,1),\"\")","v":407},"Optometrista"]
["Környezet- és foglalkozás-egészségügyi foglalkozású","Szellemi",2221,{"$f":"--ISNUMBER(SEARCH(Adatlap!$C$32,FEOR!A409))","v":1},{"$f":"IF(D409=1,SUMIF($D$2:D409,1),\"\")","v":408},"Környezet- és foglalkozás-egészségügyi foglalkozású"]
["Gyógyszerész, szakgyógyszerész","Szellemi",2214,{"$f":"--ISNUMBER(SEARCH(Adatlap!$C$32,FEOR!A410))","v":1},{"$f":"IF(D410=1,SUMIF($D$2:D410,1),\"\")","v":409},"Gyógyszerész, szakgyógyszerész"]
["Fogorvos, fogszakorvos","Szellemi",2213,{"$f":"--ISNUMBER(SEARCH(Adatlap!$C$32,FEOR!A411))","v":1},{"$f":"IF(D411=1,SUMIF($D$2:D411,1),\"\")","v":410},"Fogorvos, fogszakorvos"]
["Szakorvos","Szellemi",2212,{"$f":"--ISNUMBER(SEARCH(Adatlap!$C$32,FEOR!A412))","v":1},{"$f":"IF(D412=1,SUMIF($D$2:D412,1),\"\")","v":411},"Szakorvos"]
["Általános orvos","Szellemi",2211,{"$f":"--ISNUMBER(SEARCH(Adatlap!$C$32,FEOR!A413))","v":1},{"$f":"IF(D413=1,SUMIF($D$2:D413,1),\"\")","v":412},"Általános orvos"]
["Egyéb természettudományi foglalkozású","Szellemi",2169,{"$f":"--ISNUMBER(SEARCH(Adatlap!$C$32,FEOR!A414))","v":1},{"$f":"IF(D414=1,SUMIF($D$2:D414,1),\"\")","v":413},"Egyéb természettudományi foglalkozású"]
["Környezetfelmérő, -tanácsadó","Szellemi",2168,{"$f":"--ISNUMBER(SEARCH(Adatlap!$C$32,FEOR!A415))","v":1},{"$f":"IF(D415=1,SUMIF($D$2:D415,1),\"\")","v":414},"Környezetfelmérő, -tanácsadó"]
["Biológus, botanikus, zoológus és rokon foglalkozású","Szellemi",2167,{"$f":"--ISNUMBER(SEARCH(Adatlap!$C$32,FEOR!A416))","v":1},{"$f":"IF(D416=1,SUMIF($D$2:D416,1),\"\")","v":415},"Biológus, botanikus, zoológus és rokon foglalkozású"]
["Matematikus","Szellemi",2166,{"$f":"--ISNUMBER(SEARCH(Adatlap!$C$32,FEOR!A417))","v":1},{"$f":"IF(D417=1,SUMIF($D$2:D417,1),\"\")","v":416},"Matematikus"]
["Geológus","Szellemi",2165,{"$f":"--ISNUMBER(SEARCH(Adatlap!$C$32,FEOR!A418))","v":1},{"$f":"IF(D418=1,SUMIF($D$2:D418,1),\"\")","v":417},"Geológus"]
["Kémikus","Szellemi",2164,{"$f":"--ISNUMBER(SEARCH(Adatlap!$C$32,FEOR!A419))","v":1},{"$f":"IF(D419=1,SUMIF($D$2:D419,1),\"\")","v":418},"Kémikus"]
["Meteorológus","Szellemi",2163,{"$f":"--ISNUMBER(SEARCH(Adatlap!$C$32,FEOR!A420))","v":1},{"$f":"IF(D420=1,SUMIF($D$2:D420,1),\"\")","v":419},"Meteorológus"]
["Csillagász","Szellemi",2162,{"$f":"--ISNUMBER(SEARCH(Adatlap!$C$32,FEOR!A421))","v":1},{"$f":"IF(D421=1,SUMIF($D$2:D421,1),\"\")","v":420},"Csillagász"]
["Fizikus","Szellemi",2161,{"$f":"--ISNUMBER(SEARCH(Adatlap!$C$32,FEOR!A422))","v":1},{"$f":"IF(D422=1,SUMIF($D$2:D422,1),\"\")","v":421},"Fizikus"]
["Egyéb adatbázis- és hálózati elemző, üzemeltető ","Szellemi",2159,{"$f":"--ISNUMBER(SEARCH(Adatlap!$C$32,FEOR!A423))","v":1},{"$f":"IF(D423=1,SUMIF($D$2:D423,1),\"\")","v":422},"Egyéb adatbázis- és hálózati elemző, üzemeltető "]
["Számítógép-hálózati elemző, üzemeltető","Szellemi",2153,{"$f":"--ISNUMBER(SEARCH(Adatlap!$C$32,FEOR!A424))","v":1},{"$f":"IF(D424=1,SUMIF($D$2:D424,1),\"\")","v":423},"Számítógép-hálózati elemző, üzemeltető"]
["Rendszergazda","Szellemi",2152,{"$f":"--ISNUMBER(SEARCH(Adatlap!$C$32,FEOR!A425))","v":1},{"$f":"IF(D425=1,SUMIF($D$2:D425,1),\"\")","v":424},"Rendszergazda"]
["Adatbázis-tervező és -üzemeltető","Szellemi",2151,{"$f":"--ISNUMBER(SEARCH(Adatlap!$C$32,FEOR!A426))","v":1},{"$f":"IF(D426=1,SUMIF($D$2:D426,1),\"\")","v":425},"Adatbázis-tervező és -üzemeltető"]
["Egyéb szoftver- és alkalmazásfejlesztő, -elemző","Szellemi",2149,{"$f":"--ISNUMBER(SEARCH(Adatlap!$C$32,FEOR!A427))","v":1},{"$f":"IF(D427=1,SUMIF($D$2:D427,1),\"\")","v":426},"Egyéb szoftver- és alkalmazásfejlesztő, -elemző"]
["Alkalmazásprogramozó","Szellemi",2144,{"$f":"--ISNUMBER(SEARCH(Adatlap!$C$32,FEOR!A428))","v":1},{"$f":"IF(D428=1,SUMIF($D$2:D428,1),\"\")","v":427},"Alkalmazásprogramozó"]
["Hálózat- és multimédia-fejlesztő","Szellemi",2143,{"$f":"--ISNUMBER(SEARCH(Adatlap!$C$32,FEOR!A429))","v":1},{"$f":"IF(D429=1,SUMIF($D$2:D429,1),\"\")","v":428},"Hálózat- és multimédia-fejlesztő"]
["Szoftverfejlesztő","Szellemi",2142,{"$f":"--ISNUMBER(SEARCH(Adatlap!$C$32,FEOR!A430))","v":1},{"$f":"IF(D430=1,SUMIF($D$2:D430,1),\"\")","v":429},"Szoftverfejlesztő"]
["Rendszerelemző (informatikai)","Szellemi",2141,{"$f":"--ISNUMBER(SEARCH(Adatlap!$C$32,FEOR!A431))","v":1},{"$f":"IF(D431=1,SUMIF($D$2:D431,1),\"\")","v":430},"Rendszerelemző (informatikai)"]
["Egyéb, máshova nem sorolható mérnök","Szellemi",2139,{"$f":"--ISNUMBER(SEARCH(Adatlap!$C$32,FEOR!A432))","v":1},{"$f":"IF(D432=1,SUMIF($D$2:D432,1),\"\")","v":431},"Egyéb, máshova nem sorolható mérnök"]
["Minőségbiztosítási mérnök","Szellemi",2137,{"$f":"--ISNUMBER(SEARCH(Adatlap!$C$32,FEOR!A433))","v":1},{"$f":"IF(D433=1,SUMIF($D$2:D433,1),\"\")","v":432},"Minőségbiztosítási mérnök"]
["Grafikus és multimédia-tervező ","Szellemi",2136,{"$f":"--ISNUMBER(SEARCH(Adatlap!$C$32,FEOR!A434))","v":1},{"$f":"IF(D434=1,SUMIF($D$2:D434,1),\"\")","v":433},"Grafikus és multimédia-tervező "]
["Földmérő és térinformatikus","Szellemi",2135,{"$f":"--ISNUMBER(SEARCH(Adatlap!$C$32,FEOR!A435))","v":1},{"$f":"IF(D435=1,SUMIF($D$2:D435,1),\"\")","v":434},"Földmérő és térinformatikus"]
["Település- és közlekedéstervező mérnök","Szellemi",2134,{"$f":"--ISNUMBER(SEARCH(Adatlap!$C$32,FEOR!A436))","v":1},{"$f":"IF(D436=1,SUMIF($D$2:D436,1),\"\")","v":435},"Település- és közlekedéstervező mérnök"]
["Táj- és kertépítészmérnök","Szellemi",2133,{"$f":"--ISNUMBER(SEARCH(Adatlap!$C$32,FEOR!A437))","v":1},{"$f":"IF(D437=1,SUMIF($D$2:D437,1),\"\")","v":436},"Táj- és kertépítészmérnök"]
["Erdő- és természetvédelmi mérnök","Szellemi",2132,{"$f":"--ISNUMBER(SEARCH(Adatlap!$C$32,FEOR!A438))","v":1},{"$f":"IF(D438=1,SUMIF($D$2:D438,1),\"\")","v":437},"Erdő- és természetvédelmi mérnök"]
["Mezőgazdasági mérnök","Szellemi",2131,{"$f":"--ISNUMBER(SEARCH(Adatlap!$C$32,FEOR!A439))","v":1},{"$f":"IF(D439=1,SUMIF($D$2:D439,1),\"\")","v":438},"Mezőgazdasági mérnök"]
["Telekommunikációs mérnök","Szellemi",2123,{"$f":"--ISNUMBER(SEARCH(Adatlap!$C$32,FEOR!A440))","v":1},{"$f":"IF(D440=1,SUMIF($D$2:D440,1),\"\")","v":439},"Telekommunikációs mérnök"]
["Villamosmérnök (elektronikai mérnök)","Szellemi",2122,{"$f":"--ISNUMBER(SEARCH(Adatlap!$C$32,FEOR!A441))","v":1},{"$f":"IF(D441=1,SUMIF($D$2:D441,1),\"\")","v":440},"Villamosmérnök (elektronikai mérnök)"]
["Villamosmérnök (energetikai mérnök)","Szellemi",2121,{"$f":"--ISNUMBER(SEARCH(Adatlap!$C$32,FEOR!A442))","v":1},{"$f":"IF(D442=1,SUMIF($D$2:D442,1),\"\")","v":441},"Villamosmérnök (energetikai mérnök)"]
["Gépészmérnök","Szellemi",2118,{"$f":"--ISNUMBER(SEARCH(Adatlap!$C$32,FEOR!A443))","v":1},{"$f":"IF(D443=1,SUMIF($D$2:D443,1),\"\")","v":442},"Gépészmérnök"]
["Vegyészmérnök","Szellemi",2117,{"$f":"--ISNUMBER(SEARCH(Adatlap!$C$32,FEOR!A444))","v":1},{"$f":"IF(D444=1,SUMIF($D$2:D444,1),\"\")","v":443},"Vegyészmérnök"]
["Építőmérnök","Szellemi",2116,{"$f":"--ISNUMBER(SEARCH(Adatlap!$C$32,FEOR!A445))","v":1},{"$f":"IF(D445=1,SUMIF($D$2:D445,1),\"\")","v":444},"Építőmérnök"]
["Építészmérnök","Szellemi",2115,{"$f":"--ISNUMBER(SEARCH(Adatlap!$C$32,FEOR!A446))","v":1},{"$f":"IF(D446=1,SUMIF($D$2:D446,1),\"\")","v":445},"Építészmérnök"]
["Fa- és könnyűipari mérnök","Szellemi",2114,{"$f":"--ISNUMBER(SEARCH(Adatlap!$C$32,FEOR!A447))","v":1},{"$f":"IF(D447=1,SUMIF($D$2:D447,1),\"\")","v":446},"Fa- és könnyűipari mérnök"]
["Élelmiszer-ipari mérnök","Szellemi",2113,{"$f":"--ISNUMBER(SEARCH(Adatlap!$C$32,FEOR!A448))","v":1},{"$f":"IF(D448=1,SUMIF($D$2:D448,1),\"\")","v":447},"Élelmiszer-ipari mérnök"]
["Kohó- és anyagmérnök","Szellemi",2112,{"$f":"--ISNUMBER(SEARCH(Adatlap!$C$32,FEOR!A449))","v":1},{"$f":"IF(D449=1,SUMIF($D$2:D449,1),\"\")","v":448},"Kohó- és anyagmérnök"]
["Bányamérnök","Szellemi",2111,{"$f":"--ISNUMBER(SEARCH(Adatlap!$C$32,FEOR!A450))","v":1},{"$f":"IF(D450=1,SUMIF($D$2:D450,1),\"\")","v":449},"Bányamérnök"]
["Egyéb gazdasági tevékenységet segítő egység vezetője","Szellemi",1419,{"$f":"--ISNUMBER(SEARCH(Adatlap!$C$32,FEOR!A451))","v":1},{"$f":"IF(D451=1,SUMIF($D$2:D451,1),\"\")","v":450},{"$f":"IFERROR(INDEX($A$2:$A$486,MATCH(ROW(F450),$E$2:$E$486,0)),\"\")","v":"Egyéb gazdasági tevékenységet segítő egység vezetője"}]
["Reklám-, PR- és egyéb kommunikációs tevékenységet folytató egység vezetője","Szellemi",1416,{"$f":"--ISNUMBER(SEARCH(Adatlap!$C$32,FEOR!A452))","v":1},{"$f":"IF(D452=1,SUMIF($D$2:D452,1),\"\")","v":451},"Reklám-, PR- és egyéb kommunikációs tevékenységet folytató egység vezetője"]
["Értékesítési és marketingtevékenységet folytató egység vezetője","Szellemi",1415,{"$f":"--ISNUMBER(SEARCH(Adatlap!$C$32,FEOR!A453))","v":1},{"$f":"IF(D453=1,SUMIF($D$2:D453,1),\"\")","v":452},"Értékesítési és marketingtevékenységet folytató egység vezetője"]
["Vállalati stratégiatervezési egység vezetője","Szellemi",1414,{"$f":"--ISNUMBER(SEARCH(Adatlap!$C$32,FEOR!A454))","v":1},{"$f":"IF(D454=1,SUMIF($D$2:D454,1),\"\")","v":453},"Vállalati stratégiatervezési egység vezetője"]
["Kutatási és fejlesztési tevékenységet folytató egység vezetője","Szellemi",1413,{"$f":"--ISNUMBER(SEARCH(Adatlap!$C$32,FEOR!A455))","v":1},{"$f":"IF(D455=1,SUMIF($D$2:D455,1),\"\")","v":454},"Kutatási és fejlesztési tevékenységet folytató egység vezetője"]
["Személyzeti vezető, humánpolitikai egység vezetője","Szellemi",1412,{"$f":"--ISNUMBER(SEARCH(Adatlap!$C$32,FEOR!A456))","v":1},{"$f":"IF(D456=1,SUMIF($D$2:D456,1),\"\")","v":455},"Személyzeti vezető, humánpolitikai egység vezetője"]
["Számviteli és pénzügyi tevékenységet folytató egység vezetője","Szellemi",1411,{"$f":"--ISNUMBER(SEARCH(Adatlap!$C$32,FEOR!A457))","v":1},{"$f":"IF(D457=1,SUMIF($D$2:D457,1),\"\")","v":456},"Számviteli és pénzügyi tevékenységet folytató egység vezetője"]
["Egyéb kereskedelmi, vendéglátó és hasonló szolgáltatási tevékenységet folytató egység vezetője","Szellemi",1339,{"$f":"--ISNUMBER(SEARCH(Adatlap!$C$32,FEOR!A458))","v":1},{"$f":"IF(D458=1,SUMIF($D$2:D458,1),\"\")","v":457},"Egyéb kereskedelmi, vendéglátó és hasonló szolgáltatási tevékenységet folytató egység vezetője"]
["Sport- és rekreációs tevékenységet folytató egység vezetője","Szellemi",1336,{"$f":"--ISNUMBER(SEARCH(Adatlap!$C$32,FEOR!A459))","v":1},{"$f":"IF(D459=1,SUMIF($D$2:D459,1),\"\")","v":458},"Sport- és rekreációs tevékenységet folytató egység vezetője"]
["Kulturális tevékenységet folytató egység vezetője","Szellemi",1335,{"$f":"--ISNUMBER(SEARCH(Adatlap!$C$32,FEOR!A460))","v":1},{"$f":"IF(D460=1,SUMIF($D$2:D460,1),\"\")","v":459},"Kulturális tevékenységet folytató egység vezetője"]
["Üzleti szolgáltatási tevékenységet folytató egység vezetője ","Szellemi",1334,{"$f":"--ISNUMBER(SEARCH(Adatlap!$C$32,FEOR!A461))","v":1},{"$f":"IF(D461=1,SUMIF($D$2:D461,1),\"\")","v":460},"Üzleti szolgáltatási tevékenységet folytató egység vezetője "]
["Kereskedelmi tevékenységet folytató egység vezetője","Szellemi",1333,{"$f":"--ISNUMBER(SEARCH(Adatlap!$C$32,FEOR!A462))","v":1},{"$f":"IF(D462=1,SUMIF($D$2:D462,1),\"\")","v":461},"Kereskedelmi tevékenységet folytató egység vezetője"]
["Vendéglátó tevékenységet folytató egység vezetője","Szellemi",1332,{"$f":"--ISNUMBER(SEARCH(Adatlap!$C$32,FEOR!A463))","v":1},{"$f":"IF(D463=1,SUMIF($D$2:D463,1),\"\")","v":462},"Vendéglátó tevékenységet folytató egység vezetője"]
["Szálláshely-szolgáltatási tevékenységet folytató egység vezetője","Szellemi",1331,{"$f":"--ISNUMBER(SEARCH(Adatlap!$C$32,FEOR!A464))","v":1},{"$f":"IF(D464=1,SUMIF($D$2:D464,1),\"\")","v":463},"Szálláshely-szolgáltatási tevékenységet folytató egység vezetője"]
["Egyéb szolgáltatást nyújtó egység vezetője","Szellemi",1329,{"$f":"--ISNUMBER(SEARCH(Adatlap!$C$32,FEOR!A465))","v":1},{"$f":"IF(D465=1,SUMIF($D$2:D465,1),\"\")","v":464},"Egyéb szolgáltatást nyújtó egység vezetője"]
["Oktatási-nevelési tevékenységet folytató egység vezetője","Szellemi",1328,{"$f":"--ISNUMBER(SEARCH(Adatlap!$C$32,FEOR!A466))","v":1},{"$f":"IF(D466=1,SUMIF($D$2:D466,1),\"\")","v":465},"Oktatási-nevelési tevékenységet folytató egység vezetője"]
["Egészségügyi tevékenységet folytató egység vezetője","Szellemi",1327,{"$f":"--ISNUMBER(SEARCH(Adatlap!$C$32,FEOR!A467))","v":1},{"$f":"IF(D467=1,SUMIF($D$2:D467,1),\"\")","v":466},"Egészségügyi tevékenységet folytató egység vezetője"]
["Idősgondozási tevékenységet folytató egység vezetője","Szellemi",1326,{"$f":"--ISNUMBER(SEARCH(Adatlap!$C$32,FEOR!A468))","v":1},{"$f":"IF(D468=1,SUMIF($D$2:D468,1),\"\")","v":467},"Idősgondozási tevékenységet folytató egység vezetője"]
["Gyermekgondozási tevékenységet folytató egység vezetője","Szellemi",1325,{"$f":"--ISNUMBER(SEARCH(Adatlap!$C$32,FEOR!A469))","v":1},{"$f":"IF(D469=1,SUMIF($D$2:D469,1),\"\")","v":468},"Gyermekgondozási tevékenységet folytató egység vezetője"]
["Szociális tevékenységet folytató egység vezetője","Szellemi",1324,{"$f":"--ISNUMBER(SEARCH(Adatlap!$C$32,FEOR!A470))","v":1},{"$f":"IF(D470=1,SUMIF($D$2:D470,1),\"\")","v":469},"Szociális tevékenységet folytató egység vezetője"]
["Pénzintézeti tevékenységet folytató egység vezetője","Szellemi",1323,{"$f":"--ISNUMBER(SEARCH(Adatlap!$C$32,FEOR!A471))","v":1},{"$f":"IF(D471=1,SUMIF($D$2:D471,1),\"\")","v":470},"Pénzintézeti tevékenységet folytató egység vezetője"]
["Informatikai és telekommunikációs tevékenységet folytató egység vezetője","Szellemi",1322,{"$f":"--ISNUMBER(SEARCH(Adatlap!$C$32,FEOR!A472))","v":1},{"$f":"IF(D472=1,SUMIF($D$2:D472,1),\"\")","v":471},"Informatikai és telekommunikációs tevékenységet folytató egység vezetője"]
["Szállítási, logisztikai és raktározási tevékenységet folytató egység vezetője","Szellemi",1321,{"$f":"--ISNUMBER(SEARCH(Adatlap!$C$32,FEOR!A473))","v":1},{"$f":"IF(D473=1,SUMIF($D$2:D473,1),\"\")","v":472},"Szállítási, logisztikai és raktározási tevékenységet folytató egység vezetője"]
["Építőipari tevékenységet folytató egység vezetője","Szellemi",1313,{"$f":"--ISNUMBER(SEARCH(Adatlap!$C$32,FEOR!A474))","v":1},{"$f":"IF(D474=1,SUMIF($D$2:D474,1),\"\")","v":473},"Építőipari tevékenységet folytató egység vezetője"]
["Ipari tevékenységet folytató egység vezetője","Szellemi",1312,{"$f":"--ISNUMBER(SEARCH(Adatlap!$C$32,FEOR!A475))","v":1},{"$f":"IF(D475=1,SUMIF($D$2:D475,1),\"\")","v":474},"Ipari tevékenységet folytató egység vezetője"]
["Mezőgazdasági, erdészeti, halászati és vadászati tevékenységet folytató egység vezetője","Szellemi",1311,{"$f":"--ISNUMBER(SEARCH(Adatlap!$C$32,FEOR!A476))","v":1},{"$f":"IF(D476=1,SUMIF($D$2:D476,1),\"\")","v":475},"Mezőgazdasági, erdészeti, halászati és vadászati tevékenységet folytató egység vezetője"]
["Gazdasági, költségvetési szervezet vezetője (igazgató, elnök, ügyvezető igazgató)","Szellemi",1210,{"$f":"--ISNUMBER(SEARCH(Adatlap!$C$32,FEOR!A477))","v":1},{"$f":"IF(D477=1,SUMIF($D$2:D477,1),\"\")","v":476},"Gazdasági, költségvetési szervezet vezetője (igazgató, elnök, ügyvezető igazgató)"]
["Egyházi vezető","Szellemi",1132,{"$f":"--ISNUMBER(SEARCH(Adatlap!$C$32,FEOR!A478))","v":1},{"$f":"IF(D478=1,SUMIF($D$2:D478,1),\"\")","v":477},"Egyházi vezető"]
["Társadalmi (érdek-képviseleti) és egyéb szervezet vezetője","Szellemi",1131,{"$f":"--ISNUMBER(SEARCH(Adatlap!$C$32,FEOR!A479))","v":1},{"$f":"IF(D479=1,SUMIF($D$2:D479,1),\"\")","v":478},"Társadalmi (érdek-képviseleti) és egyéb szervezet vezetője"]
["Helyi önkormányzat kinevezett vezetője","Szellemi",1123,{"$f":"--ISNUMBER(SEARCH(Adatlap!$C$32,FEOR!A480))","v":1},{"$f":"IF(D480=1,SUMIF($D$2:D480,1),\"\")","v":479},"Helyi önkormányzat kinevezett vezetője"]
["Helyi önkormányzat választott vezetője","Szellemi",1122,{"$f":"--ISNUMBER(SEARCH(Adatlap!$C$32,FEOR!A481))","v":1},{"$f":"IF(D481=1,SUMIF($D$2:D481,1),\"\")","v":480},"Helyi önkormányzat választott vezetője"]
["Országos és területi közigazgatás, igazságszolgáltatás vezetője","Szellemi",1121,{"$f":"--ISNUMBER(SEARCH(Adatlap!$C$32,FEOR!A482))","v":1},{"$f":"IF(D482=1,SUMIF($D$2:D482,1),\"\")","v":481},"Országos és területi közigazgatás, igazságszolgáltatás vezetője"]
["Törvényhozó, miniszter, államtitkár","Szellemi",1110,{"$f":"--ISNUMBER(SEARCH(Adatlap!$C$32,FEOR!A483))","v":1},{"$f":"IF(D483=1,SUMIF($D$2:D483,1),\"\")","v":482},"Törvényhozó, miniszter, államtitkár"]
["Fegyveres szervek középfokú képesítést nem igénylő foglalkozásai","Fizikai",310,{"$f":"--ISNUMBER(SEARCH(Adatlap!$C$32,FEOR!A484))","v":1},{"$f":"IF(D484=1,SUMIF($D$2:D484,1),\"\")","v":483},"Fegyveres szervek középfokú képesítést nem igénylő foglalkozásai"]
["Fegyveres szervek középfokú képesítést igénylő foglalkozásai","Fizikai",210,{"$f":"--ISNUMBER(SEARCH(Adatlap!$C$32,FEOR!A485))","v":1},{"$f":"IF(D485=1,SUMIF($D$2:D485,1),\"\")","v":484},"Fegyveres szervek középfokú képesítést igénylő foglalkozásai"]
["Fegyveres szervek felsőfokú képesítést igénylő foglalkozásai","Fizikai",110,{"$f":"--ISNUMBER(SEARCH(Adatlap!$C$32,FEOR!A486))","v":1},{"$f":"IF(D486=1,SUMIF($D$2:D486,1),\"\")","v":485},"Fegyveres szervek felsőfokú képesítést igénylő foglalkozásai"]