{"text_format":"1","workbook":"xlsx","n_sheets":5,"sheets":["Adatlap","Kulcs-Soft","BANK","Munka1","FEOR"],"not_rendered":{"charts":0,"images":1,"macros":1,"external_links":0,"defined_names":2,"comments":0,"pivot_tables":0},"unopened":[],"bounds":{"document_bytes":16777216,"sheet_cells":100000,"rows_first":2000,"rows_last":500,"rows_between":2000,"halvings":0,"cell_chars":16384,"cell_head_chars":4096},"cells_cut":0,"cells_raw":0,"read":"whole","date_system":"1900"}

{"sheet":"Adatlap","index":0,"n_rows":3588,"n_cols":24,"rows_kept":3588,"cut":false,"hidden":false,"merged":[[2,0,2,13],[45,6,45,9],[3,0,3,13],[23,5,23,12],[30,6,30,8],[31,6,31,8],[32,6,32,8],[40,1,40,12],[41,1,41,12],[42,1,42,12],[30,2,30,4],[32,2,32,4],[31,2,31,4],[6,6,6,8],[31,9,31,11],[30,9,30,11],[50,1,50,12],[43,1,43,12]]}
[]
[]
["ADATLAP BÉRSZÁMFEJTÉSHEZ"]
[null,null,null,null,null,null,null,null,null,null,null,null,null,null,null,"Kérem válasszon!","Kérem válasszon!","Kérem válasszon!",null,"Kérem válasszon!","Postal Code\nIrányítószám","Place Name\nTelepülés","County\nMegye"]
[null,null,null,null,null,null,null,null,null,null,null,null,null,null,null,"IGEN","nő",1,null,20,8128,"Aba","Fejér"]
[null,null,"vezetéknév","keresztnév 1","keresztnév 2",null,"neme",null,null,null,null,null,null,null,null,"NEM","férfi",2,null,30,8127,"Aba","Fejér"]
[null,"Munkavállaló neve: ",null,null,null,null,"férfi",null,null,null,null,null,null,null,null,null,null,3,null,70,5241,"Abádszalók","Jász-Nagykun-Szolnok"]
[null,"Születési neve:",null,null,null,null,null,null,null,null,null,null,null,null,null,null,null,4,null,null,7678,"Abaliget","Baranya"]
[null,"Anyja neve:",null,null,null,null,null,null,null,null,null,null,null,null,null,null,null,5,null,null,3261,"Abasár","Heves"]
[null,"Állampolgálsága:",null,null,null,null,null,null,null,null,null,null,null,null,null,null,null,6,null,null,3882,"Abaújalpár","Borsod-Abaúj-Zemplén"]
[null,null,"ország","város",null,null,null,null,null,null,null,null,null,null,null,null,null,7,null,null,3882,"Abaújkér","Borsod-Abaúj-Zemplén"]
[null,"Szül. hely:","Magyarország",null,null,null,null,null,null,null,null,null,null,null,null,null,null,8,null,null,3815,"Abaújlak","Borsod-Abaúj-Zemplén"]
[null,null,"év","hónap","nap",null,null,null,null,null,null,null,null,null,null,null,null,9,null,null,3881,"Abaújszántó","Borsod-Abaúj-Zemplén"]
[null,"Szül. idő:",null,null,null,null,null,null,null,null,null,null,null,null,null,null,null,10,null,null,3809,"Abaújszolnok","Borsod-Abaúj-Zemplén"]
[null,null,null,null,null,null,null,null,null,null,null,null,null,null,null,null,null,11,null,null,3898,"Abaújvár","Borsod-Abaúj-Zemplén"]
[null,"Adóazonosító:",null,"TAJ sz.:",null,null,null,null,null,null,null,null,null,null,null,null,null,12,null,null,9151,"Abda","Győr-Moson-Sopron"]
[null,null,null,null,null,null,null,null,null,null,null,null,null,null,null,null,null,null,null,null,3753,"Abod","Borsod-Abaúj-Zemplén"]
[null,"Nyugdíjas: ","NEM","kezdő nap:",null,"Nyugdíj. tipusa "]
[null,null,null,null,null,null,null,null,null,null,null,null,null,null,null,null,null,null,null,null,null,2740,"Abony"]
[null,null,"ország","irányítószám","város","közterület","jellege","házszám","épület","lh.","emelet","ajtó","terület",null,null,null,null,null,null,null,null,8256,"Ábrahámhegy","Pest"]
[null,"Állandó lakcíme:",null,null,null,null,null,null,null,null,null,null,null,null,null,null,null,null,null,null,null,2941,"Ács","Veszprém"]
[null,"Levelezési címe:",null,null,null,null,null,null,null,null,null,null,null,null,null,null,null,null,null,null,null,null,null,"Komárom-Esztergom"]
[null,null,null,null,null,null,null,null,null,null,null,null,null,null,null,null,null,null,null,null,2683,"Acsa","Pest"]
[null,"Iskolai végzettsége:",null,null,"Intézmény megnevezése:",null,null,null,null,null,null,null,null,null,null,null,null,null,null,null,9746,"Acsád","Vas"]
[null,"Igazoló dokumentum száma:"]
[null,null,null,null,null,null,null,null,null,null,null,null,null,null,null,null,null,null,null,null,9168,"Acsalag","Győr-Moson-Sopron"]
[null,"Bankszámlaszáma:",null,null,null,null,null,null,null,null,null,null,null,null,null,null,null,null,null,null,2887,"Ácsteszér","Komárom-Esztergom"]
[null,"E-mail címe: ",null,null,null,null,null,null,null,null,null,null,null,null,null,null,null,null,null,null,3292,"Adács","Heves"]
[null,"Mobil telefonszám:","Kérem válasszon!"]
[null,null,null,null,null,null,null,null,null,null,null,null,null,null,null,null,null,null,null,null,8653,"Ádánd","Somogy"]
[null,"Munkahely neve:",null,null,null,"Belépés dátuma:",null,null,null,"Összeg:",null,null,null,null,null,null,null,null,null,null,8561,"Adásztevel","Veszprém"]
[null,"Munkakör:",null,null,null,"Munkabér:","Kérem válasszon!",null,null,null,null,null,null,null,null,null,null,null,null,null,2457,"Adony","Fejér"]
[null,"Munkarend:","Kérem válasszon!",null,null,"Munkaidő:"]
[null,null,null,null,null,null,null,null,null,null,null,null,null,null,null,null,null,null,null,null,8497,"Adorjánháza","Veszprém"]
[null,"Előző munkahelyről hozott igazolások",null,null,null,null,null,null,null,null,null,null,null,null,null,null,null,null,null,null,7841,"Adorjás","Baranya"]
[null,null,"Munkaviszony igazolás",null,"Adó adatlap",null,"TB kiskönyv"]
[null,null,null,null,null,null,null,null,null,null,null,null,null,null,null,null,null,null,null,null,7381,"Ág","Baranya"]
[null,"Egyéb igazolás:"]
[null,null,null,null,null,null,null,null,null,null,null,null,null,null,null,null,null,null,null,null,6076,"Ágasegyháza","Bács-Kiskun"]
[null,"Nyilatkozat",null,null,null,null,null,null,null,null,null,null,null,null,null,null,null,null,null,null,9423,"Ágfalva","Győr-Moson-Sopron"]
{"$rows_left_out":3549}
{"sheet":"Kulcs-Soft","index":1,"n_rows":9,"n_cols":107,"rows_kept":9,"cut":false,"hidden":true,"merged":[]}
["Személyi adatok",null,null,null,null,null,null,null,null,null,null,null,null,null,null,"Elérhetőség",null,null,null,null,null,null,null,null,null,null,"Levelezési cím",null,null,null,null,null,null,null,null,null,null,"Telefon",null,null,null,null,null,"Nyugdíj",null,"Banki adatok",null,"Iskolai végzettség",null,null,null,"Jogviszony alapadatok",null,null,null,null,null,null,null,null,null,null,null,null,null,null,null,null,"Törzsbér",null,"Személyi alapbér",null,null,"Szerződés szerinti bér",null,"Jövedelem kifizetés","Szabadság adatok","Adókedvezmények/adóalap kedvezmények",null,null,null,null,null,null,null,"Munkáltatói kedvezmények",null,null,null,null,"Karrier híd program kedvezmény","Egyéb adatok","Munkaidő keret",null,null,null,null,null,null,null,null,"Munkaerő kölcsönzés"]
["Sorszám","Vezetéknév","Keresztnév","Születési vezetéknév","Születési keresztnév","Adóazonosító","TAJ-szám","Anyja születési neve","Születési dátum","Születési ország","Születési hely","Nem","Állampolgárság","Előnév","Családi állapot","Irányítószám","Város","Közterület","Közterület jellege","Házszám","Épület","Lépcsőház","Emelet","Ajtó","Terület","Ország","Irányítószám Levelezési","Város Levelezési","Közterület Levelezési","Közterület jellege Levelezési","Házszám Levelezési","Épület Levelezési","Lépcsőház Levelezési","Emelet Levelezési","Ajtó Levelezési","Terület Levelezési","Ország Levelezési","Ország előhívó","Körzet","Telefonszám","Mellék","E-mail cím","Elektronikus bérjegyzék E-mail cím","Nyugdíj kezdete","Nyugdíj típusa (apeh kód)","Bank (kód)","Bankszámlaszám","Iskola neve","Bizonyítvány száma","Szakképesítés (OKJ kód)","Megszerzés dátuma","Jogviszony kezdete","Kilépés dátuma","Kilépés mód (kód)","Határozott idejű","Határozott idő várh. vége","Foglalkozási viszony (kód)","Munkarend (kód)","Jogviszony megnevezése","FEOR","Részletes jelenlétadat nyilvántartás használata","Telephely (Kód)","Költséghely (Kód)","Szervezeti egység (kód)","Munkakör (Kód)","Munkaszám (Kód)","Részlegszám (Kód)","Másodlagos főkönyvi szám","Bér típusa","Bér összege","Fizetési osztály","Fizetési fokozat","Garantált illetmény növekmény(%)","Szerződés szerinti bér típusa","Szerződés szerinti bér összege","Kifizetés módja","Szabadság nyilvántartás órában","Súlyos fogyatékos kedv. mértéke","Családi adóalapkedv. összege","Csal. adóalapkedv. megosztás","Csal. járulékkedv. igénybevétel","Első házasok kedv. Összege","Házasságkötés időpontja","Érvényesség utolsó hónapja","Első házasok kedv. megosztás","Kedvezmény (kód)","GYES/GYET/GYED mellett fogl.","Anyasági ell. megszünése","Jogosultság, vagy GYES/GYET/GYED mellett fogl. kezd.","legfeljebb 180 nap munkaviszony","Karrier híd","Import azonosító","Kezdő dátum","Záró dátum","Munkaidőkeret típusa","Vállalt havi óraszám","Óraszám","Órabéres havi elszámolt óraszáma","Teljesített óraszám","Ebből ledolgozott óraszám","Nem fizetett magáncélú távollét óraszáma","Év végi óraszám egyenleg","Munkaerő kölcs. kezdete","Munkaerő kölcs. vége","Munkaerő kölcs. partner (sorszám)","Munkaerő kölcs. időarányos szab.","Munkaerő kölcs. rehab. jár. számításnál létsz. nem számító"]
[null,{"$f":"Adatlap!C7","v":0},{"$f":"IF(ISBLANK(Adatlap!E7),Adatlap!D7,CONCATENATE(Adatlap!D7,\" \",Adatlap!E7))","v":0},{"$f":"Adatlap!C8","v":0},{"$f":"IF(ISBLANK(Adatlap!E8),Adatlap!D8,CONCATENATE(Adatlap!D8,\" \",Adatlap!E8))","v":0},{"$f":"Adatlap!C16","v":0},{"$f":"Adatlap!E16","v":0},{"$f":"IF(ISBLANK(Adatlap!E9),CONCATENATE(Adatlap!C9,\" \",Adatlap!D9),CONCATENATE(Adatlap!C9,\" \",Adatlap!D9,\" \",Adatlap!E9))","v":" "},{"$f":"CONCATENATE(Adatlap!C14,\".\",Adatlap!D14,\".\",Adatlap!E14)","v":".."},{"$f":"Adatlap!C12","v":"Magyarország"},{"$f":"Adatlap!D12","v":0},{"$f":"IF(Adatlap!G7=\"nő\",2,IF(Adatlap!G7=\"férfi\",1,\"!!!\"))","v":1},{"$f":"Adatlap!C10","v":0},null,null,{"$f":"Adatlap!D21","v":0},{"$f":"Adatlap!E21","v":0},{"$f":"Adatlap!F21","v":0},{"$f":"Adatlap!G21","v":0},{"$f":"Adatlap!H21","v":0},{"$f":"Adatlap!I21","v":0},{"$f":"Adatlap!J21","v":0},{"$f":"Adatlap!K21","v":0},{"$f":"Adatlap!L21","v":0},{"$f":"Adatlap!M21","v":0},{"$f":"Adatlap!C21","v":0},{"$f":"Adatlap!D22","v":0},{"$f":"Adatlap!E22","v":0},{"$f":"Adatlap!F22","v":0},{"$f":"Adatlap!G22","v":0},{"$f":"Adatlap!H22","v":0},{"$f":"Adatlap!I22","v":0},{"$f":"Adatlap!J22","v":0},{"$f":"Adatlap!K22","v":0},{"$f":"Adatlap!L22","v":0},{"$f":"Adatlap!M22","v":0},{"$f":"Adatlap!C22","v":0},36,{"$f":"Adatlap!C29","v":"Kérem válasszon!"},{"$f":"Adatlap!D29","v":0},null,{"$f":"Adatlap!C28","v":0},null,null,null,null,null,null,null,null,null,{"$f":"Adatlap!G31","v":"00:00:00"},null,null,null,null,null,{"$f":"Adatlap!C33","v":"Kérem válasszon!"},null,{"$f":"_xlfn.IFNA(VLOOKUP(Adatlap!$C$32,FEOR!$A$2:$C$486,3,FALSE),\"\")","v":""},"N",null,null,null,{"$f":"IF(ISNUMBER(VLOOKUP(Adatlap!C32,FEOR!$A$2:$C$486,3,FALSE)),Adatlap!C32,\"Nem a listából választott név!\")","v":"Nem a listából választott név!"},null,null,null,{"$f":"IF(BF3=BF9,\"megbízási díj\",VLOOKUP(Adatlap!G32,'Kulcs-Soft'!$BP$5:$BQ$8,2,FALSE))","v":{"$error":"#N/A"}},{"$f":"Adatlap!G32","v":"Kérem válasszon!"}]
[null,null,null,null,null,null,null,null,null,null,null,null,null,null,null,null,null,null,null,null,null,null,null,null,null,null,null,null,null,null,null,null,null,null,null,null,null,null,null,null,null,null,null,null,null,null,null,null,null,null,null,null,null,null,null,null,null,"Kérem válasszon!",null,null,null,null,null,null,null,null,null,"Kérem válasszon!"]
[null,null,null,null,null,null,null,null,null,null,null,null,null,null,null,null,null,null,null,null,null,null,null,null,null,null,null,null,null,null,null,null,null,null,null,null,null,null,null,null,null,null,null,null,null,null,null,null,null,null,null,null,null,null,null,null,null,2,null,null,null,null,null,null,null,null,null,"Havi bér","HB"]
[null,null,null,null,null,null,null,null,null,null,null,null,null,null,null,null,null,null,null,null,null,null,null,null,null,null,null,null,null,null,null,null,null,null,null,null,null,null,null,null,null,null,null,null,null,null,null,null,null,null,null,null,null,null,null,null,null,4,null,null,null,null,null,null,null,null,null,"Heti bér","HEB"]
[null,null,null,null,null,null,null,null,null,null,null,null,null,null,null,null,null,null,null,null,null,null,null,null,null,null,null,null,null,null,null,null,null,null,null,null,null,null,null,null,null,null,null,null,null,null,null,null,null,null,null,null,null,null,null,null,null,6,null,null,null,null,null,null,null,null,null,"Napi bér","NB"]
[null,null,null,null,null,null,null,null,null,null,null,null,null,null,null,null,null,null,null,null,null,null,null,null,null,null,null,null,null,null,null,null,null,null,null,null,null,null,null,null,null,null,null,null,null,null,null,null,null,null,null,null,null,null,null,null,null,8,null,null,null,null,null,null,null,null,null,"Óra bér","OB"]
[null,null,null,null,null,null,null,null,null,null,null,null,null,null,null,null,null,null,null,null,null,null,null,null,null,null,null,null,null,null,null,null,null,null,null,null,null,null,null,null,null,null,null,null,null,null,null,null,null,null,null,null,null,null,null,null,null,"megbízási"]

{"sheet":"BANK","index":2,"n_rows":101,"n_cols":4,"rows_kept":101,"cut":false,"hidden":true,"merged":[]}
["bankszámla szém első száma","Bank","kód"]
[11734286," OTP Észak","keleti r., Miskolc "," Auch, 3527 Miskolc, József A. u. 87."]
[64800028," B3 TAKARÉK Szövetkezet, 2030 Érd, Fürdő u. 1.","keleti r., Miskolc "," Auchan, 3527 Miskolc, József A. u. 87."]
[12001008," Raiffeisen Bank Zrt. Budapesti Fiók, 1054 Budapest, Akadémia u. 6."]
[50300147," MECSEK TAKARÉK Szövetkezet, 7030 Paks, Villany u. 4."]
[58100051," Sárbogárd és Vidéke Takarékszövetkezet, 7013 Cece, Deák Ferenc u. 6."]
[18203648," FHB Bank Zrt. 364 MP Fiók K"]
[61200113," Polgári Takarékszövetkezet, 4090 Polgár, Hősök útja 8."]
[10409015," K&H Bank Zrt. 901 Budapest, 1146 Budapest, Ajtósi Dürer sor 10."]
[11773384," OTP Hajdú"]
[10103898," Budapest Bank Zrt. Váci fiók, 2600 Vác, Köztársaság u. 10."]
[10700615," CIB Bank Zrt. Rákoskeresztúri fiók, 1173 Budapest, Pesti út 170."]
[55800123," Szerencs és Környéke Takarékszövetk, 3909 Mád, Rákóczi F. u. 49.","Magyaro., 1082 Budapest, Üllői út 48."]
[10700749," CIB Bank Zrt. Siófoki fiók, 8600 Siófok, Szabadság tér 15.","Magyaro, 1082 Budapest, Üllői út 48."]
[10700024," CIB Bank Zrt Medve u. fiók, 1027 Budapest, Medve u. 4"]
[10702143," CIB Bank Zrt. Piliscsabai fiók, 2081 Piliscsaba, Kinizsi u. 1"]
[11773535," OTP Fejér megyei LAFO fiók, 8000 Székesféhervár, Ősz u. 13."]
[10047004," Magyar Államkincstár. Szombathely, 9700 Szombathely, Széll Kálmán u. 20.","Bihar megyei LAFO fiók, 4025 Debrecen, Piac u. 45","47."]
[10918001," UniCredit Bank Hungary Zrt. Head Of, 1054 Budapest, Szabadság tér 5"]
[10400566," K&H Bank Zrt. 056 Jászberény, 5100 Jászberény, Szabadság tér 1."]
[10205000," K&H Bank Zrt. Lakosság, 1095 Budapest, Lechner Ödön fasor 9."]
[53700072," Békés Takarék Szövetkezet, 5553 Kondoros, Csabai út 14."]
[10023002," Magyar Államkincstár. Budapest, 1139 Bp., Váci út 71."]
[11773494," OTP Zala megyei LAFO fiók, 8900 Zalaegerszeg, Kisfaludy u. 15"]
[14100237," Sberbank Magyarország Zrt Zugló, 1144 Budapest, Hungária krt. 140"]
[10400054," K&H Bank Zrt. 105 Budapest, 1036 Budapest, Bécsi út 57"]
[16300000," Deutsche Bank Europe GmbH Mo","14."]
[12072552," Raiffeisen Bank Zrt. Pécs III., 7621 Pécs, Irgalmasok útja 5.","3."]
[10103104," Budapest Bank Zrt. Nyugati téri fió, 1132 Budapest, Nyugati tér 4","9."]
[69300114," Fegyvernek és Vid. Körz. Takszöv, 5231 Fegyvernek, Szent Erzsébet út 138."]
[11773456," OTP Jász"]
[73200158," Kinizsi Bank Zrt., 1122 Budapest, Krisztina körút 2.","6."]
[10700354," CIB Bank Zrt. Bajai fiók, 6500 Baja, Déri Fr. sétány 1","6."]
[11991119," Erste Bank Nyrt Lakossági folyószámla, 1138 Budapest, Népfürdő u. 24"]
[10103551," Budapest Bank Zrt. Gyöngyösi fiók, 3200 Gyöngyös, Fő tér 19."]
[10403181," K&H Bank Zrt. 318 Budapest, 1024 Budapest, Margit krt. 43","79."]
[70600092," Dunaföldvár és Vidéke Takarékszövet, 7056 Szedres, Arany J. u. 2."]
[72600115," SAVARIA Takarékszövetkezet, 9653 Répcelak, Petőfi u. 50."]
[10104789," Budapest Bank Zrt. Szombathelyi fió, 9700 Szombathely, Kőszegi u. 3/a."]
[11600006," Erste Bank Zrt., 1138 Budapest, Népfürdő u. 24","17."]
{"$rows_left_out":62}
{"sheet":"Munka1","index":3,"n_rows":0,"n_cols":0,"rows_kept":0,"cut":false,"hidden":true,"merged":[]}

{"sheet":"FEOR","index":4,"n_rows":486,"n_cols":10,"rows_kept":486,"cut":false,"hidden":true,"merged":[]}
["Megnevezés","Állománycsoport","Kód","IF Found","Frequency","Searchable list",null,null,null,{"$f":"Adatlap!$C$32","v":0}]
["Egyszerű erdészeti, vadászati és halászati foglalkozású","Fizikai",9332,{"$f":"--ISNUMBER(SEARCH(Adatlap!$C$32,FEOR!A2))","v":1},{"$f":"IF(D2=1,SUMIF($D$2:D2,1),\"\")","v":1},{"$f":"IFERROR(INDEX($A$2:$A$486,MATCH(ROW(F1),$E$2:$E$486,0)),\"\")","v":"Egyszerű erdészeti, vadászati és halászati foglalkozású"}]
["Egyszerű mezőgazdasági foglalkozású","Fizikai",9331,{"$f":"--ISNUMBER(SEARCH(Adatlap!$C$32,FEOR!A3))","v":1},{"$f":"IF(D3=1,SUMIF($D$2:D3,1),\"\")","v":2},{"$f":"IFERROR(INDEX($A$2:$A$486,MATCH(ROW(F2),$E$2:$E$486,0)),\"\")","v":"Egyszerű mezőgazdasági foglalkozású"}]
["Egyéb egyszerű építőipari foglalkozású","Fizikai",9329,{"$f":"--ISNUMBER(SEARCH(Adatlap!$C$32,FEOR!A4))","v":1},{"$f":"IF(D4=1,SUMIF($D$2:D4,1),\"\")","v":3},"Egyéb egyszerű építőipari foglalkozású"]
["Kubikos","Fizikai",9321,{"$f":"--ISNUMBER(SEARCH(Adatlap!$C$32,FEOR!A5))","v":1},{"$f":"IF(D5=1,SUMIF($D$2:D5,1),\"\")","v":4},"Kubikos"]
["Egyszerű ipari foglalkozású","Fizikai",9310,{"$f":"--ISNUMBER(SEARCH(Adatlap!$C$32,FEOR!A6))","v":1},{"$f":"IF(D6=1,SUMIF($D$2:D6,1),\"\")","v":5},"Egyszerű ipari foglalkozású"]
["Egyéb, máshova nem sorolható egyszerű szolgáltatási és szállítási foglalkozású","Fizikai",9239,{"$f":"--ISNUMBER(SEARCH(Adatlap!$C$32,FEOR!A7))","v":1},{"$f":"IF(D7=1,SUMIF($D$2:D7,1),\"\")","v":6},"Egyéb, máshova nem sorolható egyszerű szolgáltatási és szállítási foglalkozású"]
["Parkolóőr","Fizikai",9238,{"$f":"--ISNUMBER(SEARCH(Adatlap!$C$32,FEOR!A8))","v":1},{"$f":"IF(D8=1,SUMIF($D$2:D8,1),\"\")","v":7},"Parkolóőr"]
["Háztartási alkalmazott","Fizikai",9237,{"$f":"--ISNUMBER(SEARCH(Adatlap!$C$32,FEOR!A9))","v":1},{"$f":"IF(D9=1,SUMIF($D$2:D9,1),\"\")","v":8},"Háztartási alkalmazott"]
["Konyhai kisegítő","Fizikai",9236,{"$f":"--ISNUMBER(SEARCH(Adatlap!$C$32,FEOR!A10))","v":1},{"$f":"IF(D10=1,SUMIF($D$2:D10,1),\"\")","v":9},"Konyhai kisegítő"]
["Gyorséttermi eladó","Fizikai",9235,{"$f":"--ISNUMBER(SEARCH(Adatlap!$C$32,FEOR!A11))","v":1},{"$f":"IF(D11=1,SUMIF($D$2:D11,1),\"\")","v":10},"Gyorséttermi eladó"]
["Hordár, csomagkihordó","Fizikai",9234,{"$f":"--ISNUMBER(SEARCH(Adatlap!$C$32,FEOR!A12))","v":1},{"$f":"IF(D12=1,SUMIF($D$2:D12,1),\"\")","v":11},"Hordár, csomagkihordó"]
["Hivatalsegéd, kézbesítő","Fizikai",9233,{"$f":"--ISNUMBER(SEARCH(Adatlap!$C$32,FEOR!A13))","v":1},{"$f":"IF(D13=1,SUMIF($D$2:D13,1),\"\")","v":12},"Hivatalsegéd, kézbesítő",{"$f":"$F$2:INDEX($F$2:$F$486,COUNTIF($F$2:$F$486,\"?*\"))","v":"Hivatalsegéd, kézbesítő"}]
["Mérőóra-leolvasó és hasonló egyszerű foglalkozású","Fizikai",9232,{"$f":"--ISNUMBER(SEARCH(Adatlap!$C$32,FEOR!A14))","v":1},{"$f":"IF(D14=1,SUMIF($D$2:D14,1),\"\")","v":13},"Mérőóra-leolvasó és hasonló egyszerű foglalkozású"]
["Portás, telepőr, egyszerű őr","Fizikai",9231,{"$f":"--ISNUMBER(SEARCH(Adatlap!$C$32,FEOR!A15))","v":1},{"$f":"IF(D15=1,SUMIF($D$2:D15,1),\"\")","v":14},"Portás, telepőr, egyszerű őr"]
["Kézi csomagoló","Fizikai",9225,{"$f":"--ISNUMBER(SEARCH(Adatlap!$C$32,FEOR!A16))","v":1},{"$f":"IF(D16=1,SUMIF($D$2:D16,1),\"\")","v":15},"Kézi csomagoló"]
["Pultfeltöltő, árufeltöltő","Fizikai",9224,{"$f":"--ISNUMBER(SEARCH(Adatlap!$C$32,FEOR!A17))","v":1},{"$f":"IF(D17=1,SUMIF($D$2:D17,1),\"\")","v":16},"Pultfeltöltő, árufeltöltő"]
["Rakodómunkás","Fizikai",9223,{"$f":"--ISNUMBER(SEARCH(Adatlap!$C$32,FEOR!A18))","v":1},{"$f":"IF(D18=1,SUMIF($D$2:D18,1),\"\")","v":17},"Rakodómunkás"]
["Állati erővel vont jármű hajtója","Fizikai",9222,{"$f":"--ISNUMBER(SEARCH(Adatlap!$C$32,FEOR!A19))","v":1},{"$f":"IF(D19=1,SUMIF($D$2:D19,1),\"\")","v":18},"Állati erővel vont jármű hajtója"]
["Pedálos vagy kézi hajtású gépek vezetője","Fizikai",9221,{"$f":"--ISNUMBER(SEARCH(Adatlap!$C$32,FEOR!A20))","v":1},{"$f":"IF(D20=1,SUMIF($D$2:D20,1),\"\")","v":19},"Pedálos vagy kézi hajtású gépek vezetője"]
["Hulladékosztályozó","Fizikai",9212,{"$f":"--ISNUMBER(SEARCH(Adatlap!$C$32,FEOR!A21))","v":1},{"$f":"IF(D21=1,SUMIF($D$2:D21,1),\"\")","v":20},"Hulladékosztályozó"]
["Szemétgyűjtő, utcaseprő","Fizikai",9211,{"$f":"--ISNUMBER(SEARCH(Adatlap!$C$32,FEOR!A22))","v":1},{"$f":"IF(D22=1,SUMIF($D$2:D22,1),\"\")","v":21},"Szemétgyűjtő, utcaseprő"]
["Egyéb takarító és kisegítő","Fizikai",9119,{"$f":"--ISNUMBER(SEARCH(Adatlap!$C$32,FEOR!A23))","v":1},{"$f":"IF(D23=1,SUMIF($D$2:D23,1),\"\")","v":22},"Egyéb takarító és kisegítő"]
["Ablaktisztító","Fizikai",9115,{"$f":"--ISNUMBER(SEARCH(Adatlap!$C$32,FEOR!A24))","v":1},{"$f":"IF(D24=1,SUMIF($D$2:D24,1),\"\")","v":23},"Ablaktisztító"]
["Járműtakarító","Fizikai",9114,{"$f":"--ISNUMBER(SEARCH(Adatlap!$C$32,FEOR!A25))","v":1},{"$f":"IF(D25=1,SUMIF($D$2:D25,1),\"\")","v":24},"Járműtakarító"]
["Kézi mosó, vasaló","Fizikai",9113,{"$f":"--ISNUMBER(SEARCH(Adatlap!$C$32,FEOR!A26))","v":1},{"$f":"IF(D26=1,SUMIF($D$2:D26,1),\"\")","v":25},"Kézi mosó, vasaló"]
["Intézményi takarító és kisegítő ","Fizikai",9112,{"$f":"--ISNUMBER(SEARCH(Adatlap!$C$32,FEOR!A27))","v":1},{"$f":"IF(D27=1,SUMIF($D$2:D27,1),\"\")","v":26},"Intézményi takarító és kisegítő "]
["Háztartási takarító és kisegítő","Fizikai",9111,{"$f":"--ISNUMBER(SEARCH(Adatlap!$C$32,FEOR!A28))","v":1},{"$f":"IF(D28=1,SUMIF($D$2:D28,1),\"\")","v":27},"Háztartási takarító és kisegítő"]
["Hajószemélyzet, kormányos, matróz","Fizikai",8430,{"$f":"--ISNUMBER(SEARCH(Adatlap!$C$32,FEOR!A29))","v":1},{"$f":"IF(D29=1,SUMIF($D$2:D29,1),\"\")","v":28},"Hajószemélyzet, kormányos, matróz"]
["Targoncavezető","Fizikai",8425,{"$f":"--ISNUMBER(SEARCH(Adatlap!$C$32,FEOR!A30))","v":1},{"$f":"IF(D30=1,SUMIF($D$2:D30,1),\"\")","v":29},"Targoncavezető"]
["Daru, felvonó és hasonló anyagmozgató gép kezelője","Fizikai",8424,{"$f":"--ISNUMBER(SEARCH(Adatlap!$C$32,FEOR!A31))","v":1},{"$f":"IF(D31=1,SUMIF($D$2:D31,1),\"\")","v":30},"Daru, felvonó és hasonló anyagmozgató gép kezelője"]
["Köztisztasági, településtisztasági gép kezelője","Fizikai",8423,{"$f":"--ISNUMBER(SEARCH(Adatlap!$C$32,FEOR!A32))","v":1},{"$f":"IF(D32=1,SUMIF($D$2:D32,1),\"\")","v":31},"Köztisztasági, településtisztasági gép kezelője"]
["Földmunkagép és hasonló könnyű- és nehézgép kezelője","Fizikai",8422,{"$f":"--ISNUMBER(SEARCH(Adatlap!$C$32,FEOR!A33))","v":1},{"$f":"IF(D33=1,SUMIF($D$2:D33,1),\"\")","v":32},"Földmunkagép és hasonló könnyű- és nehézgép kezelője"]
["Mezőgazdasági, erdőgazdasági, növényvédő gépkezelő","Fizikai",8421,{"$f":"--ISNUMBER(SEARCH(Adatlap!$C$32,FEOR!A34))","v":1},{"$f":"IF(D34=1,SUMIF($D$2:D34,1),\"\")","v":33},"Mezőgazdasági, erdőgazdasági, növényvédő gépkezelő"]
["Egyéb járművezető és kapcsolódó foglalkozású","Fizikai",8419,{"$f":"--ISNUMBER(SEARCH(Adatlap!$C$32,FEOR!A35))","v":1},{"$f":"IF(D35=1,SUMIF($D$2:D35,1),\"\")","v":34},"Egyéb járművezető és kapcsolódó foglalkozású"]
["Autóbuszvezető","Fizikai",8418,{"$f":"--ISNUMBER(SEARCH(Adatlap!$C$32,FEOR!A36))","v":1},{"$f":"IF(D36=1,SUMIF($D$2:D36,1),\"\")","v":35},"Autóbuszvezető"]
["Tehergépkocsi-vezető, kamionsofőr","Fizikai",8417,{"$f":"--ISNUMBER(SEARCH(Adatlap!$C$32,FEOR!A37))","v":1},{"$f":"IF(D37=1,SUMIF($D$2:D37,1),\"\")","v":36},"Tehergépkocsi-vezető, kamionsofőr"]
["Személygépkocsi-vezető","Fizikai",8416,{"$f":"--ISNUMBER(SEARCH(Adatlap!$C$32,FEOR!A38))","v":1},{"$f":"IF(D38=1,SUMIF($D$2:D38,1),\"\")","v":37},"Személygépkocsi-vezető"]
["Trolibuszvezető","Fizikai",8415,{"$f":"--ISNUMBER(SEARCH(Adatlap!$C$32,FEOR!A39))","v":1},{"$f":"IF(D39=1,SUMIF($D$2:D39,1),\"\")","v":38},"Trolibuszvezető"]
["Metróvezető","Fizikai",8414,{"$f":"--ISNUMBER(SEARCH(Adatlap!$C$32,FEOR!A40))","v":1},{"$f":"IF(D40=1,SUMIF($D$2:D40,1),\"\")","v":39},"Metróvezető"]
{"$rows_left_out":446}